{"text_format":"1","workbook":"xlsx","n_sheets":12,"sheets":["INTRO","CALC","PRINTOUT","INFO","HEATLOSS","PARAMETER_R","TEMPERATUR","PARAMETER_HL","Product_description","Language","Release Info","VB"],"not_rendered":{"charts":0,"images":2,"macros":1,"external_links":0,"defined_names":13,"comments":0,"pivot_tables":1},"unopened":[{"sheet":"VB","index":11,"reason":"part_missing"}],"bounds":{"document_bytes":16777216,"sheet_cells":100000,"rows_first":2000,"rows_last":500,"rows_between":2000,"halvings":0,"cell_chars":16384,"cell_head_chars":4096},"cells_cut":0,"cells_raw":0,"read":"whole","date_system":"1900"}

{"sheet":"INTRO","index":0,"n_rows":23,"n_cols":9,"rows_kept":23,"cut":false,"hidden":false,"merged":[]}
[null,null,null,null,null,null,null,null,"QUICK CALC v10.01"]
[]
["Copyright © 2020 by Thermaflex International Holding b.v."]
[]
["Pipe sizing tools of A to B connection for Heating, Geothermal distribution lines and Sanitary applications (closed and open systems)."]
["This Calculation tool includes the dated material properties and specifications of the Flexalen pre-insulated pipe systems:"]
["Flexalen PB"]
["Flexalen 600 / Flexalen 600SL"]
["Flexalen PU / Flexalen PU SL"]
[]
{"$rows_left_out":14}
{"sheet":"CALC","index":1,"n_rows":33,"n_cols":29,"rows_kept":33,"cut":false,"hidden":false,"merged":[[30,3,30,4],[2,1,2,11],[3,1,3,11],[4,1,4,11],[29,3,29,4],[18,8,18,9]]}
["© 2020 THERMAFLEX / Unautorized sharing or distribution of calculation tool is forbidden! ",null,null,null,null,null,null,null,null,null,null,null,null,null,null,null,null,null,null,null,null,null,null,null,null,null,null,"LANGUAGE","PRODUCT"]
[null,null,null,null,null,null,null,null,null,null,null,null,null,null,null,null,null,null,null,null,null,null,null,null,null,null,null,null,{"$f":"IF(PARAMETER_HL!J5=\"\",\"\",PARAMETER_HL!J5)","v":"1010-090032-001"}]
[null,{"$f":"HLOOKUP($K$32,Language!$B:$Y,2,0)","v":"VÝPOČET POTRUBÍ PRO TRUBNÍ VEDENÍ - SPOJENÍ DVOU BODŮJEDNOTRUBNÍM NEBO DVOUTRUBNÍM VEDENÍM"},null,null,null,null,null,null,null,null,null,null,null,null,null,null,null,null,null,null,null,null,null,null,null,null,null,"ENGLISH",{"$f":"IF(PARAMETER_HL!J6=\"\",\"\",PARAMETER_HL!J6)","v":"1210-091032-001"}]
[null,{"$f":"HLOOKUP($K$32,Language!$B:$Y,3,0)","v":"FLEXALEN - PŘEDIZOLOVANÉ POTRUBNÍ SYSTÉMY"},null,null,null,null,null,null,null,null,null,null,null,null,null,null,null,null,null,null,null,null,null,null,null,null,null,"GERMAN",{"$f":"IF(PARAMETER_HL!J7=\"\",\"\",PARAMETER_HL!J7)","v":"1000-090032-001"}]
[null,{"$f":"HLOOKUP($K$32,Language!$B:$Y,4,0)","v":"VYVINUTO PRO ROZVODY VODY A SYSTÉMY DÁLKOVÉHO TOPENÍ "},null,null,null,null,null,null,null,null,null,null,null,null,null,null,null,null,null,null,null,null,null,null,null,null,null,"BULAGRIAN",{"$f":"IF(PARAMETER_HL!J8=\"\",\"\",PARAMETER_HL!J8)","v":""}]
[null,null,null,null,null,null,null,null,null,null,null,null,null,null,null,null,null,null,null,null,null,null,null,null,null,null,null,"DUTCH ",{"$f":"IF(PARAMETER_HL!J9=\"\",\"\",PARAMETER_HL!J9)","v":""}]
[null,null,null,null,null,null,null,null,null,null,null,null,null,null,null,null,null,null,null,null,null,null,null,null,null,null,null,"FRENCH",{"$f":"IF(PARAMETER_HL!J10=\"\",\"\",PARAMETER_HL!J10)","v":""}]
[null,{"$f":"HLOOKUP($K$32,Language!$A:$Y,51,0)","v":"PROSÍM VYPLŇTE UŽITÍ:"},{"$f":"HLOOKUP($K$32,Language!$A:$Y,52,0)","v":"TEPLÁ VODA  →"},null,null,null,{"$f":"HLOOKUP($K$32,Language!$A:$Y,22,0)","v":"POUŽITELNÝ TEPELNÝ SPÁD"},null,{"$f":"IFERROR(IF(G29=\"E\",HLOOKUP($K$32,Language!$A:$Y,36,0),K16-K18),HLOOKUP($K$32,Language!$A:$Y,78,0))","v":"Choose product"},null,null,null,null,null,null,null,null,null,null,null,null,null,null,null,null,null,null,"ROMANIAN",{"$f":"IF(PARAMETER_HL!J11=\"\",\"\",PARAMETER_HL!J11)","v":""}]
[null,null,{"$f":"HLOOKUP($K$32,Language!$A:$Y,53,0)","v":"TOPENÍ/CHLAZENÍ →"},null,null,null,{"$f":"HLOOKUP($K$32,Language!$A:$Y,23,0)","v":"POUŽITELNÉ ZATÍŽENÍ"},null,{"$f":"IFERROR(IF(G29=\"E\",HLOOKUP($K$32,Language!$A:$Y,36,0),TEMPERATUR!C28),HLOOKUP($K$32,Language!$A:$Y,78,0))","v":"Choose product"},null,null,null,null,null,null,null,null,null,null,null,null,null,null,null,null,null,null,"TURKISH",{"$f":"IF(PARAMETER_HL!J12=\"\",\"\",PARAMETER_HL!J12)","v":""}]
[null,null,null,null,null,null,{"$f":"HLOOKUP($K$32,Language!$A:$Y,24,0)","v":"OBSAH SÍTĚ"},null,{"$f":"TEMPERATUR!G12","v":0},null,null,null,null,null,null,null,null,null,null,null,null,null,null,null,null,null,null,"RUSSIAN",{"$f":"IF(PARAMETER_HL!J13=\"\",\"\",PARAMETER_HL!J13)","v":""}]
{"$rows_left_out":24}
{"sheet":"PRINTOUT","index":2,"n_rows":33,"n_cols":11,"rows_kept":33,"cut":false,"hidden":false,"merged":[]}
[]
[null,{"$f":"CALC!B3","v":"VÝPOČET POTRUBÍ PRO TRUBNÍ VEDENÍ - SPOJENÍ DVOU BODŮJEDNOTRUBNÍM NEBO DVOUTRUBNÍM VEDENÍM"}]
[null,{"$f":"CALC!B4","v":"FLEXALEN - PŘEDIZOLOVANÉ POTRUBNÍ SYSTÉMY"}]
[null,{"$f":"CALC!B5","v":"VYVINUTO PRO ROZVODY VODY A SYSTÉMY DÁLKOVÉHO TOPENÍ "}]
[]
[]
[null,null,null,null,null,null,null,null,{"$f":"CALC!B24","v":"DA (DIMENZE)"},null,{"$f":"CALC!D24","v":25}]
[null,null,null,null,null,null,null,null,{"$f":"CALC!B25","v":"RYCHLOST PROUDĚNÍ"},null,{"$f":"CALC!D25","v":0}]
[null,"FLEXALEN",null,{"$f":"CALC!H30","v":"TOPENÍ/CHLAZENÍ(P/V)"},null,null,null,null,{"$f":"CALC!B21","v":"OBJEMOVÝ PRŮTOK"},null,{"$f":"CALC!D21","v":0}]
[null,null,null,null,null,null,null,null,{"$f":"CALC!B20","v":"VÝKON ZDROJE (kW)"},null,{"$f":"CALC!D20","v":0}]
{"$rows_left_out":24}
{"sheet":"INFO","index":3,"n_rows":39,"n_cols":4,"rows_kept":39,"cut":false,"hidden":false,"merged":[[7,1,7,2],[8,1,8,2],[9,1,9,2],[6,0,6,2]]}
["INFORMATION"]
[]
["SIZE TUNING ","Change the calculated pipe size"]
[]
["With the “Size tuning” factor you are able changing the diameter calculated by the software by simulating higher or lower heat loads or volumetric flows."]
[]
["Size tuning – factor"]
["<1","Pipe diameter will decrease"]
[1,"Standard setting"]
[">1","Pipe diameter increase"]
{"$rows_left_out":30}
{"sheet":"HEATLOSS","index":4,"n_rows":10,"n_cols":4,"rows_kept":10,"cut":false,"hidden":true,"merged":[]}
[]
[]
[]
[]
[]
[]
[]
[]
[{"$f":"CALC!D30","v":0},{"$f":"PARAMETER_R!C28","v":0},{"$f":"CALC!#REF!","v":{"$error":"#REF!"}},{"$f":"B9*C9","v":{"$error":"#REF!"}}]
["Product","Trench length [m]","Heat loss [W/m]","Heat loss total [W]"]
{"$rows_left_out":1}
{"sheet":"PARAMETER_R","index":5,"n_rows":31,"n_cols":13,"rows_kept":31,"cut":false,"hidden":true,"merged":[]}
["QF",1.83,"Materialkonstante für Rohrreibung",null,null,null,"KS-Druckkonstante A",null,1.008,"Multiplikator P-D ",null,0.75]
["TF",1.02,"Temperaturkonstante für dyn. Viskosität",null,null,null,"KS Druckkonstante B",null,1E-4,"Begrenzung ab D",null,125]
["Mediumdichte",0.98,"Mediumdichte des Rohrinhaltes",null,null,null,"Bodentemperatur °C",null,10,"max Druck bar Begrenzung",null,10]
["DRUCKVERLUSTE UND GRENZWERTE LAUT DATENBLATT",null,null,null,null,null,"Kunststoff",null,null,"DIMENSIONSFAKTOR"]
["DRUCKVERLUSTTABELLE","DI 1mm",21325,"PaT90/m","RN=",{"$f":"4^(1/7)","v":1.2190136542044754},"Pmax=",8,null,1,"ENTSPRICHT"]
["TYP","DI","PaT90/m","l/sec max","l/sec opt","L/sec min","v/min","V/max","V/optimal","AUSWAHL","Vmax"]
[25,20.399999999999999,540.04752961653776,0.39528957600000003,0.25873499519999998,0.10453939199999999,0.32,1.2100000000000002,0.79200000000000004,0.22661694000000002,1.2100000000000002]
[25,20.399999999999999,540.04752961653776,0.39528957600000003,0.25873499519999998,0.10453939199999999,0.32,1.2100000000000002,0.79200000000000004,0.22661694000000002,1.2100000000000002]
[25,20.399999999999999,{"$f":"$C$5/(B9^$F$5)","v":540.04752961653776},{"$f":"((B9/2)^2*3.14*H9)/1000","v":0.39528957600000003},{"$f":"((B9/2)^2*3.14*I9)/1000","v":0.25873499519999998},{"$f":"((B9/2)^2*3.14*G9)/1000","v":0.10453939199999999},0.32,1.2100000000000002,0.79200000000000004,0.22661694000000002,{"$f":"(J10*1000)/((B9/2)^2*3.14)","v":1.2100000000000002}]
[32,26,401.80673157834582,0.70047119999999996,0.4582249100000001,0.19634419999999997,0.37,1.32,0.86350000000000016,0.39528957600000003,1.32]
{"$rows_left_out":22}
{"sheet":"TEMPERATUR","index":6,"n_rows":28,"n_cols":8,"rows_kept":28,"cut":false,"hidden":true,"merged":[]}
[]
["CALCULATION TEMPERATURE DROP:"]
[]
[null,"Supply line / Heating, Cooling",{"$f":"CALC!G29","v":"D"},"(E or D)"]
[null,"Product choosen",{"$f":"CALC!D30","v":0}]
[]
[null,null,"PIPE","PIPE"]
[null,null,"FLOW","RETURN"]
["O.D. ","Diameter pipe",{"$f":"CALC!$K$15","v":25},{"$f":"CALC!$K$17","v":25},"mm"]
["ϑ","Temperature medium",{"$f":"CALC!$D$11","v":0},{"$f":"CALC!$D$12","v":0},"°C"]
{"$rows_left_out":19}
{"sheet":"PARAMETER_HL","index":7,"n_rows":88,"n_cols":26,"rows_kept":88,"cut":false,"hidden":true,"merged":[]}
[{"$f":"CALC!D24","v":25},{"$f":"CALC!G29","v":"D"},null,null,null,null,null,null,null,"O.D. [mm]",32]
[null,null,null,null,null,null,null,null,"f=ϑ.x+d","Type","E"]
["O.D. [mm]","TF Range","Type",2,"TF code","help","U","d","[W/m]"]
[25,"F600","E",null,"1010-090025-001",{"$f":"C4&E4","v":"E1010-090025-001"},0.14799999999999999,null,{"$f":"G4*(CALC!$D$11-CALC!$H$21)","v":-1.48},"Zeilenbeschriftungen",null,null,null,null,null,null,null,null,null,null,null,null,null,null,null,{"$f":"D4","v":0}]
[32,"F600","E",null,"1010-090032-001","E1010-090032-001",0.182,null,{"$f":"G5*(CALC!$D$11-CALC!$H$21)","v":-1.8199999999999998},"1010-090032-001",null,null,null,null,null,null,null,null,null,null,null,null,null,null,null,{"$f":"D5","v":0}]
[40,"F600","E",null,"1010-090040-001","E1010-090040-001",0.23,null,{"$f":"G6*(CALC!$D$11-CALC!$H$21)","v":-2.3000000000000003},"1210-091032-001",null,null,null,null,null,null,null,null,null,null,null,null,null,null,null,0]
[50,"F600","E",null,"1010-125050-001","E1010-125050-001",0.219,null,{"$f":"G7*(CALC!$D$11-CALC!$H$21)","v":-2.19},"1000-090032-001",null,null,null,null,null,null,null,null,null,null,null,null,null,null,null,0]
[63,"F600","E",null,"1010-125063-001","E1010-125063-001",0.28999999999999998,null,{"$f":"G8*(CALC!$D$11-CALC!$H$21)","v":-2.9},null,null,null,null,null,null,null,null,null,null,null,null,null,null,null,null,0]
[75,"F600","E",null,"1010-160075-001","E1010-160075-001",0.26500000000000001,null,{"$f":"G9*(CALC!$D$11-CALC!$H$21)","v":-2.6500000000000004},null,null,null,null,null,null,null,null,null,null,null,null,null,null,null,null,0]
[90,"F600","E",null,"1010-160090-001","E1010-160090-001",0.33600000000000002,null,{"$f":"G10*(CALC!$D$11-CALC!$H$21)","v":-3.3600000000000003},null,null,null,null,null,null,null,null,null,null,null,null,null,null,null,null,0]
{"$rows_left_out":79}
{"sheet":"Product_description","index":8,"n_rows":223,"n_cols":7,"rows_kept":223,"cut":false,"hidden":true,"merged":[]}
["Code","System","SP1","SP2","CP","ND","Description"]
[{"$f":"PARAMETER_HL!E4","v":"1010-090025-001"},"F600",25,null,90,"(DN20)",{"$f":"B2&\" \"&C2&D2&\" / \"&E2&\" \"&F2","v":"F600 25 / 90 (DN20)"}]
[{"$f":"PARAMETER_HL!E5","v":"1010-090032-001"},"F600",32,null,90,"(DN25)",{"$f":"B3&\" \"&C3&D3&\" / \"&E3&\" \"&F3","v":"F600 32 / 90 (DN25)"}]
[{"$f":"PARAMETER_HL!E6","v":"1010-090040-001"},"F600",40,null,90,"(DN32)","F600 40 / 90 (DN32)"]
[{"$f":"PARAMETER_HL!E7","v":"1010-125050-001"},"F600",50,null,125,"(DN40)","F600 50 / 125 (DN40)"]
[{"$f":"PARAMETER_HL!E8","v":"1010-125063-001"},"F600",63,null,125,"(DN50)","F600 63 / 125 (DN50)"]
[{"$f":"PARAMETER_HL!E9","v":"1010-160075-001"},"F600",75,null,160,"(DN65)","F600 75 / 160 (DN65)"]
[{"$f":"PARAMETER_HL!E10","v":"1010-160090-001"},"F600",90,null,160,"(DN80)","F600 90 / 160 (DN80)"]
[{"$f":"PARAMETER_HL!E11","v":"1000-200110-001"},"F600",110,null,200,"(DN100)","F600 110 / 200 (DN100)"]
[{"$f":"PARAMETER_HL!E12","v":"1000-200125-001"},"F600",125,null,200,"(DN100)","F600 125 / 200 (DN100)"]
{"$rows_left_out":214}
{"sheet":"Language","index":9,"n_rows":101,"n_cols":17,"rows_kept":101,"cut":false,"hidden":true,"merged":[]}
["INDEX","ENGLISH","GERMAN","BULAGRIAN","DUTCH ","FRENCH","ROMANIAN","TURKISH","RUSSIAN","Czech","ITALIAN","HUNGARIAN","CROATIAN","POLISH","Danish ","Norweigian ","Swedish"]
[1,"PIPE SIZING FOR SINGLE OR DOUBLE LINES BETWEEN 2 NET POSITIONS","ROHRLEITUNGSBERECHNUNG  - VERBINDUNG VON ZWEI NETZPUNKTEN MIT EINZEL- ODER DOPPELLEITUNG","ОРАЗМЕРЯВАНЕ НА ТРЪБОПРОВОД - СЪЕДИНЯВАНЕ НА 2 ТОЧКИ ЧРЕЗ ЕДНО- ИЛИ ДВУТРЪБНА СИСТЕМА","BUISAFMETING VOOR ENKEL OF DUBBEL LEIDINGSYSTEEM VAN A NAAR B","DIMENSIONNEMENT TUBE FLEXALEN LIGNE SIMPLE OU DOUBLE POUR LIAISON ENTRE BATIMENTS ","DIMENSIONARE CONDUCTE CIRCUITE SIMPLE SAU DUBLE INTRE DOUA PUNCTE DIN RETEA","İKİ NOKTA ARASINDAKİ TEKLİ VEYA İKİLİ HATLAR İÇİN BORU EBADI","РАСЧЕТ ДИАМЕТРА ТРУБ ДЛЯ ОДНОТРУБНОЙ ИЛИ ДВУХТРУБНОЙ СИСТЕМ МЕЖДУ ДВУМЯ ТОЧКАМИ","VÝPOČET POTRUBÍ PRO TRUBNÍ VEDENÍ - SPOJENÍ DVOU BODŮJEDNOTRUBNÍM NEBO DVOUTRUBNÍM VEDENÍM","Dimensionamento Tubo per linee singole o doppie tra due punti distinti","Cső méretezése - két pontot összekötő egy/duplavezetékes csőrendszer","DIMENZIONIRANJE CJEVOVODA - SPOJ 2 TOČKE SUSTAVA ( A-B ) - ZA JEDNOCJEVNE ILI DVOCJEVNE SUSTAVE","Program doboru średnic dla rur pojedyńczych i podwójnych FLEXALEN pomiędzy źródłem ciepła i odbiorcą","RØR DIMENSIONERING FOR ENKELT ELLER DOBBELT RØRFØRING IMELLEM TO PUNKTER","DIMENSJONERING AV ENKLE ELLER DOBLE RØRET MELLOM TO PUNKTER","UTFORMNINGAV ENKLA ELLER DUBBLA KULVERT MELLAN TVÅ PUNKTER"]
[2,"FLEXALEN - PREINSULATED PIPE SYSTEMS","FLEXALEN - ISOLIERTE ROHRSYSTEME","FLEXALEN - СИСТЕМА ОТ ПРЕДВАРИТЕЛНО ИЗОЛИРАНИ ТРЪБИ","FLEXALEN VOORGEISOLEERD LEIDINGSYSTEEM","FLEXALEN - SYSTEME TUBES PRE-ISOLES","FLEXALEN-SISTEM CONDUCTE PREIZOLATE","FLEXALEN - ÖNYALITIMLI BORU SİSTEMLERİ","FLEXALEN - ПРЕДВАРИТЕЛЬНО ИЗОЛИРОВАННЫЕ ТРУБЫ","FLEXALEN - PŘEDIZOLOVANÉ POTRUBNÍ SYSTÉMY","Flexalen 600 - Sistema di tubi preisolati","Flexalen - előszigetelt csőrendszer","FLEXALEN 600 - PREDIZOLIRANI CIJEVNI SUSTAV","Flexalen - system preizolowanych rur","FLEXALEN - PRÆ-ISOLERET RØRSYSTEM","FLEXALEN - PREFABRIKKERT RØRSYSTEM","FLEXALEN - PREFABRIKEREDE RÖRSYSTEMER"]
[3,"MADE FOR DOMESTIC WATER DISTRIBUTION, COOLING AND HEATING SUPPLY LINES","BERECHNUNG GILT FÜR BRAUCHWASSER-, HEIZUNG- UND KÜHLLEITUNGEN","ИЗЧИСЛЕНИЕТО Е ВАЛИДНО ЗА ПИТЕЙНА ВОДА И ЗА ВОДА ПРИГОДНА ЗА ОТОПЛИТЕЛНИ СИСТЕМИ","GESCHIKT VOOR TAPWATER EN WARMTE/KOUDE DISTRIBUTIE","CE PROGRAMME EST DEFINI POUR LE CALCUL DES RESEAUX DE CHAUFFAGE ET DE DISTRIBUTION D'EAU SANITAIRE","FABRICATE PENTRU RETELE DE DISTRIBUTIE A ENERGIEI TERMICE SI APEI MENAJERE ","SICAK-SOĞUK SU TESİSATLARI VE BÖLGESEL  ISITMA  HATLARI İÇİN YAPILMIŞTIR","ЭТОТ РАСЧЕТ СДЕЛАН ДЛЯ СИСТЕМ БЫТОВОГО ВОДОСНАБЖЕНИЯ И ЦЕНТРАЛЬНОГО ОТОПЛЕНИЯ","VYVINUTO PRO ROZVODY VODY A SYSTÉMY DÁLKOVÉHO TOPENÍ ","Prodotto per distribuire acqua sanitaria e reti di teleriscaldamento","Számítások használati és Fűtővís rendszerek esetében érvényesek","IZRAČUN VRIJEDI ZA SANITARNU I NORMALNO KONDICIONIRANU VODU U TOPLOVODNIM SUSTAVIMA GRIJANJA","Przeznaczony do dystrybucji ciepłej wody użytkowej i uzdatnionej wody grzewczej","FREMSTILLET TIL DISTRIBUTION AF VARMT BRUGSVAND, KØLING OG FJERNVARME","KONSTRUERT FOR UTDELING AV  VARMTVANN, KØLING OG FJERNVARME ","AVSETT FÖR DISTRIBUTION AV VATTEN, FJÄRKYLA OCH FJÄRVARME"]
[4,"QUALITY FACTOR","QUALITÄTSFAKTOR","КАЧЕСТВЕН  ФАКТОР","KWALITEITS FACTOR","FACT QUALITE","FACTOR CALITATE","KALİTE FAKTÖRÜ","КАЧЕСТВЕННЫЙ ФАКТОР","FAKTOR JAKOSTI","Fattore Qualità","Minőségi tényező","KVALITATIVNI FAKTOR","Współczynnik jakości","KVALITETS FAKTOR","KVALITET FACTOR","KVALITETS FAKTOR"]
[5,"TEMPERATUR FACTOR","TEMPERATURFAKTOR","ТЕМПЕРАТУРЕН  ФАКТОР","TEMPERATUUR FACTOR","FACT TEMPERATURE","FACTOR TEMPERATURA","SICAKLIK FAKTÖRÜ","ТЕМПЕРАТУРНЫЙ ФАКТОР","FAKTOR TEPLOTY","Fattore Temp.","Hőmérsékleti tényező","TEMPERATURNI FAKTOR","Współczynnik temperatury","TEMPERATUR FAKTOR","TEMPERATUR FAKTOR","TEMPERATUR FAKTOR"]
[6,"SIZE TUNING","ANPASSUNG DIMENSION","ДИМЕНЗИЯ ЗА НАПАСВАНЕ","OPTIMALISERINGS FACTOR","ADAPTATION DIAMETRE","OPTIMIZARE DIMENSIONARE","BOYUT AYARLAMA","ПОДБОР ДИАМЕТРА","PŘIZPŮSOBENÍ DIMENZE","Sistema di dimensionamento","Méretezés","DIMENZIONIRANJE","Współczynnik doboru średnic","REGULERING AF STØRRELSE ","REGULERING AV STØRRELSE","REGLERING AV STORLEK"]
[7,"FLOW TEMPERATURE (Tf)","TEMPERATUR VORLAUF  (Tf)","ТЕМПЕРАТУРА ПОДАВАНЕ","AANVOER TEMPERATUUR","TEMPERATURE DEPART","TEMPERATURA TUR","GİDİŞ SICAKLIĞI [°C] Tg","ТЕМПЕРАТУРА В \"ПОДАЧЕ\" (Tп)","TEPLOTA NA PŘÍVOD. VĚTVI  (Tp )","Temp. di andata(Tf)","Előremenő hőmérséklet","TEMP. POL. (Tpolaza)","Temperatura zasilania Tz","FREMLØBS TEMPERATUR ( Tf)","TURLEDNINGSTEMPERATUR (Tf)","TILFÖRSELLEDNINGS TEMPERATUR (Tf)"]
[8,"RETURN TEMPERATURE (Tr)","TEMPERATUR RÜCKLAUF (Tr)","ВЪЗВРАТЕНА ТЕМПЕРАТУРА","RETOUR TEMPERATUUR","TEMPERATURE RETOUR","TEMPERATURA RETUR","DÖNÜŞ SICAKLIĞI [°C] Td","ТЕМПЕРАТУРА В \"ОБРАТКЕ\" (То)","TEPLOTA NA VRATNÉ VĚTVI (Tv)","Temp. di ritorno(Tr)","Visszatérő hőmérséklet","TEMP. POV. (T povrata)","Temperatura powrotu Tp","RETUR TEMPERATUR (Tr)","RETUR TEMPERATUR (Tr)","RETURLEDNINGS TEMPERATUR (Tr)"]
[9,"TEMP. DIFFERENCE (Tf - Tr)","TEMP. SPREIZUNG (Tf - Tr)","ТЕРМОРАЗЛИКА (захр./връщ.)","TEMPERATUUR VERSCHIL","DELTA T (Td-Tr)","DIFERENTA TEMPERATURA","SICAKLIK FARKI  (Tg - Td)","РАЗНИЦА ТЕМПЕРАТУР (Tп - Tо)","TEPLOTNÍ SPÁD (Tp-Tv)","Differenza di Temp.(Tf-Tr)","Hőmérsékletkülönbség","Δ T (Tpolaza - Tpovrata)","Różnica temperatur (Tz-Tp)","TEMP. FORSKEL (Tf - Tr)","TEMP. FORSKJELL (Tf - Tr)","TEMP. SKILLNAD (Tf - Tr)"]
{"$rows_left_out":92}
{"sheet":"Release Info","index":10,"n_rows":21,"n_cols":3,"rows_kept":21,"cut":false,"hidden":true,"merged":[]}
[null,"Flexalen QuickCalc "]
[null,"Flexalen 600"]
[]
["Version","Date","Changes"]
["v8.00 (beta)","2010-02-03","1st multilingual language: english, german, bulgarian, dutch, Heatloss - temperature drop updated / new outlook,..."]
["v8.00 (beta)","2010-02-09","checked by several people and corrected"]
["v8.00","2010-03-23","Sprachen OK: en, ger, ru, bul, dutch, turkish, romanian"]
["v8.01","2010-06-04","Sprachen - Übersetzungsfehler behoben; v [m/s] Tabelle angefügt; Druckstufe neu für 16-110 und 125-225; Instruction en - aktualisiert"]
["v8.10","2010-07-26","TF faktor angepasst von 1,03 auf 1,02 (nicht 1,011 wie beim großen, robusterer Wert)"]
[null,null,"Alle Beschreibungen geändert auf Flexalen anstatt Flexalen 600"]
{"$rows_left_out":11}