{"text_format":"1","workbook":"xlsx","n_sheets":10,"sheets":["INTRO","CALC","HEATLOSS","PARAMETER_R","PARAMETER_HL","PRINTOUT","TEMPERATUR","Language","Release Info","VB"],"not_rendered":{"charts":0,"images":3,"macros":1,"external_links":0,"defined_names":12,"comments":1,"pivot_tables":1},"unopened":[{"sheet":"VB","index":9,"reason":"part_missing"}],"bounds":{"document_bytes":16777216,"sheet_cells":100000,"rows_first":2000,"rows_last":500,"rows_between":2000,"halvings":0,"cell_chars":16384,"cell_head_chars":4096},"cells_cut":0,"cells_raw":0,"read":"whole","date_system":"1900"}

{"sheet":"INTRO","index":0,"n_rows":37,"n_cols":1,"rows_kept":37,"cut":false,"hidden":false,"merged":[]}
[]
[]
[]
[]
[]
[]
[]
[]
[]
[]
{"$rows_left_out":28}
{"sheet":"CALC","index":1,"n_rows":33,"n_cols":27,"rows_kept":33,"cut":false,"hidden":false,"merged":[[2,1,2,11],[3,1,3,11],[4,1,4,11],[18,8,18,9]]}
["© 1999-2011 THERMAFLEX / Unautorized passing on of the software is forbidden! ",null,null,null,null,null,null,null,null,null,null,null,null,null,null,null,null,null,null,null,null,null,null,null,null,"LANGUAGE","PRODUCT"]
[null,null,null,null,null,null,null,null,null,null,null,null,null,null,null,null,null,null,null,null,null,null,null,null,null,{"$f":"Language!B1","v":"ENGLISH"},{"$f":"IF(PARAMETER_HL!#REF!=\"\",\"\",PARAMETER_HL!#REF!)","v":{"$error":"#REF!"}}]
[null,{"$f":"HLOOKUP($K$32,Language!$B:$Y,2,0)","v":"PIPE SIZING FOR SINGLE OR DOUBLE LINES BETWEEN 2 NET POSITIONS"},null,null,null,null,null,null,null,null,null,null,null,null,null,null,null,null,null,null,null,null,null,null,null,{"$f":"Language!C1","v":"GERMAN"},{"$f":"IF(PARAMETER_HL!#REF!=\"\",\"\",PARAMETER_HL!#REF!)","v":{"$error":"#REF!"}}]
[null,{"$f":"HLOOKUP($K$32,Language!$B:$Y,3,0)","v":"FLEXALEN - PREINSULATED PIPE SYSTEMS"},null,null,null,null,null,null,null,null,null,null,null,null,null,null,null,null,null,null,null,null,null,null,null,{"$f":"Language!D1","v":"BULAGRIAN"},{"$f":"IF(PARAMETER_HL!#REF!=\"\",\"\",PARAMETER_HL!#REF!)","v":{"$error":"#REF!"}}]
[null,{"$f":"HLOOKUP($K$32,Language!$B:$Y,4,0)","v":"MADE FOR DOMESTIC WATER DISTRIBUTION, COOLING AND HEATING SUPPLY LINES"},null,null,null,null,null,null,null,null,null,null,null,null,null,null,null,null,null,null,null,null,null,null,null,{"$f":"Language!E1","v":"DUTCH "},{"$f":"IF(PARAMETER_HL!#REF!=\"\",\"\",PARAMETER_HL!#REF!)","v":{"$error":"#REF!"}}]
[null,null,null,null,null,null,null,null,null,null,null,null,null,null,null,null,null,null,null,null,null,null,null,null,null,{"$f":"Language!F1","v":"FRENCH"},{"$f":"IF(PARAMETER_HL!#REF!=\"\",\"\",PARAMETER_HL!#REF!)","v":{"$error":"#REF!"}}]
[null,null,null,null,null,null,null,null,null,null,null,null,null,null,null,null,null,null,null,null,null,null,null,null,null,{"$f":"Language!G1","v":"ROMANIAN"},{"$f":"IF(PARAMETER_HL!#REF!=\"\",\"\",PARAMETER_HL!#REF!)","v":{"$error":"#REF!"}}]
[null,{"$f":"HLOOKUP($K$32,Language!$A:$Y,51,0)","v":"PLEASE CHOOSE APPLICATION:"},{"$f":"HLOOKUP($K$32,Language!$A:$Y,52,0)","v":"SUPPLY LINE →"},null,null,null,{"$f":"HLOOKUP($K$32,Language!$A:$Y,22,0)","v":"USABLE TEMP. DIFF."},null,{"$f":"IFERROR(IF(G29=\"E\",HLOOKUP($K$32,Language!$A:$Y,36,0),K16-K18),HLOOKUP($K$32,Language!$A:$Y,78,0))","v":"Choose product"},null,null,null,null,null,null,null,null,null,null,null,null,null,null,null,null,{"$f":"Language!H1","v":"TURKISH"},{"$f":"IF(PARAMETER_HL!#REF!=\"\",\"\",PARAMETER_HL!#REF!)","v":{"$error":"#REF!"}}]
[null,null,{"$f":"HLOOKUP($K$32,Language!$A:$Y,53,0)","v":"HEATING / COOLING →"},null,null,null,{"$f":"HLOOKUP($K$32,Language!$A:$Y,23,0)","v":"USABLE LOAD"},null,{"$f":"IFERROR(IF(G29=\"E\",HLOOKUP($K$32,Language!$A:$Y,36,0),TEMPERATUR!C28),HLOOKUP($K$32,Language!$A:$Y,78,0))","v":"Choose product"},null,null,null,null,null,null,null,null,null,null,null,null,null,null,null,null,"RUSSIAN",{"$f":"IF(PARAMETER_HL!#REF!=\"\",\"\",PARAMETER_HL!#REF!)","v":{"$error":"#REF!"}}]
[null,null,null,null,null,null,{"$f":"HLOOKUP($K$32,Language!$A:$Y,24,0)","v":"NET VOLUME"},null,{"$f":"TEMPERATUR!G12","v":0},null,null,null,null,null,null,null,null,null,null,null,null,null,null,null,null,"CZECH",{"$f":"IF(PARAMETER_HL!#REF!=\"\",\"\",PARAMETER_HL!#REF!)","v":{"$error":"#REF!"}}]
{"$rows_left_out":24}
{"sheet":"HEATLOSS","index":2,"n_rows":10,"n_cols":4,"rows_kept":10,"cut":false,"hidden":true,"merged":[]}
[]
[]
[]
[]
[]
[]
[]
[]
[{"$f":"CALC!#REF!","v":{"$error":"#REF!"}},{"$f":"PARAMETER_R!C28","v":0},{"$f":"CALC!#REF!","v":{"$error":"#REF!"}},{"$f":"B9*C9","v":{"$error":"#REF!"}}]
["Product","Trench length [m]","Heat loss [W/m]","Heat loss total [W]"]
{"$rows_left_out":1}
{"sheet":"PARAMETER_R","index":3,"n_rows":31,"n_cols":13,"rows_kept":31,"cut":false,"hidden":true,"merged":[]}
["QF",1.83,"Materialkonstante für Rohrreibung",null,null,null,"KS-Druckkonstante A",null,1.008,"Multiplikator P-D ",null,0.75]
["TF",1.02,"Temperaturkonstante für dyn. Viskosität",null,null,null,"KS Druckkonstante B",null,1E-4,"Begrenzung ab D",null,125]
["Mediumdichte",0.98,"Mediumdichte des Rohrinhaltes",null,null,null,"Bodentemperatur °C",null,10,"max Druck bar Begrenzung",null,10]
["DRUCKVERLUSTE UND GRENZWERTE LAUT DATENBLATT",null,null,null,null,null,"Kunststoff",null,null,"DIMENSIONSFAKTOR"]
["DRUCKVERLUSTTABELLE","DI 1mm",21325,"PaT90/m","RN=",{"$f":"4^(1/7)","v":1.2190136542044754},"Pmax=",8,null,1,"ENTSPRICHT"]
["TYP","DI","PaT90/m","l/sec max","l/sec opt","L/sec min","v/min","V/max","V/optimal","AUSWAHL","Vmax"]
[16,11.6,{"$f":"$C$5/(B7^$F$5)","v":1074.7320903645364},{"$f":"((B7/2)^2*3.14*H7)/1000","v":9.2954048000000011E-2},{"$f":"((B7/2)^2*3.14*I7)/1000","v":6.3905908000000011E-2},{"$f":"((B7/2)^2*3.14*G7)/1000","v":3.1688880000000003E-3},0.03,0.88,0.60500000000000009,0.01,{"$f":"(J8*1000)/((B7/2)^2*3.14)","v":1.0714863258026162}]
[20,14.4,{"$f":"$C$5/(B8^$F$5)","v":825.71342453276043},0.17905536000000002,0.11638598400000003,4.5577728000000005E-2,0.28000000000000003,1.1000000000000001,0.71500000000000008,0.11318067200000002,1.3921875000000001]
[25,20.399999999999999,{"$f":"$C$5/(B9^$F$5)","v":540.04752961653776},0.39528957600000003,0.25873499519999998,0.10453939199999999,0.32,1.2100000000000002,0.79200000000000004,0.22661694000000002,1.2100000000000002]
[32,26,401.80673157834582,0.70047119999999996,0.4582249100000001,0.19634419999999997,0.37,1.32,0.86350000000000016,0.39528957600000003,{"$f":"(J11*1000)/((B10/2)^2*3.14)","v":1.32}]
{"$rows_left_out":22}
{"sheet":"PARAMETER_HL","index":4,"n_rows":94,"n_cols":39,"rows_kept":94,"cut":false,"hidden":true,"merged":[[0,23,0,24],[1,13,1,14],[1,15,1,16],[1,17,1,18],[1,19,1,20],[1,21,1,22],[1,23,1,24]]}
[{"$f":"CALC!D24","v":16},{"$f":"CALC!G29","v":"D"},null,null,1,2,3,4,5,6,7,8,9,10,11,12,13,14,15,16,17,18,19,"Temperature =",null,{"$f":"IF(CALC!G29=\"E\",CALC!D11,(CALC!D11+CALC!D12)/2)","v":0}]
[null,null,null,null,null,null,20,30,40,50,60,70,80,"20-30",null,"30-40",null,"40-50",null,"50-60",null,"60-70",null,"70-max",null,"f=ϑ.x+d",null,null,"O.D. [mm]",125]
["O.D. [mm]","TF Range","Type",2,"TF code","help",20,30,40,50,60,70,80,"x","d",null,null,null,null,null,null,null,null,null,null,"[W/m]",null,null,"Type","D"]
[16,"Standard","E",null,"VS-RH40A16",{"$f":"C4&E4","v":"EVS-RH40A16"},1.794,3.6440000000000001,5.548,7.5069999999999997,9.5190000000000001,11.585000000000001,13.704000000000001,{"$f":"SLOPE(G4:H4,$G$2:$H$2)","v":0.185},{"$f":"INTERCEPT(G4:H4,$G$2:$H$2)","v":-1.9059999999999997},{"$f":"SLOPE(H4:I4,$H$2:$I$2)","v":0.19039999999999999},{"$f":"INTERCEPT(H4:I4,$H$2:$I$2)","v":-2.0679999999999996},{"$f":"SLOPE(I4:J4,$I$2:$J$2)","v":0.19589999999999996},{"$f":"INTERCEPT(I4:J4,$I$2:$J$2)","v":-2.2879999999999985},{"$f":"SLOPE(J4:K4,$J$2:$K$2)","v":0.20120000000000005},{"$f":"INTERCEPT(J4:K4,$J$2:$K$2)","v":-2.5530000000000026},{"$f":"SLOPE(K4:L4,$K$2:$L$2)","v":0.20660000000000006},{"$f":"INTERCEPT(K4:L4,$K$2:$L$2)","v":-2.8770000000000042},{"$f":"SLOPE(L4:M4,$L$2:$M$2)","v":0.21189999999999998},{"$f":"INTERCEPT(L4:M4,$L$2:$M$2)","v":-3.2479999999999976},{"$f":"IF($Z$1>=70,$Z$1*X4+Y4,IF(AND($Z$1>=60,$Z$1<70),V4*$Z$1+W4,IF(AND($Z$1>=50,$Z$1<60),T4*$Z$1+U4,IF(AND($Z$1>=40,$Z$1<50),R4*$Z$1+S4,IF(AND($Z$1>=30,$Z$1<40),P4*$Z$1+Q4,IF(AND($Z$1>0,$Z$1<30),N4*$Z$1+O4,0))))))","v":0},{"$f":"D4","v":0},null,null,null,null,null,null,null,null,null,null,null,{"$f":"D4","v":0}]
[20,"Standard","E",null,"VS-RH40A20","EVS-RH40A20",2.3540000000000001,4.7759999999999998,7.2640000000000002,9.8190000000000008,12.439,15.122999999999999,17.87,{"$f":"SLOPE(G5:H5,$G$2:$H$2)","v":0.2422},{"$f":"INTERCEPT(G5:H5,$G$2:$H$2)","v":-2.4899999999999998},{"$f":"SLOPE(H5:I5,$H$2:$I$2)","v":0.24880000000000002},{"$f":"INTERCEPT(H5:I5,$H$2:$I$2)","v":-2.6880000000000006},{"$f":"SLOPE(I5:J5,$I$2:$J$2)","v":0.25550000000000006},{"$f":"INTERCEPT(I5:J5,$I$2:$J$2)","v":-2.9560000000000013},{"$f":"SLOPE(J5:K5,$J$2:$K$2)","v":0.2619999999999999},{"$f":"INTERCEPT(J5:K5,$J$2:$K$2)","v":-3.2809999999999935},{"$f":"SLOPE(K5:L5,$K$2:$L$2)","v":0.26839999999999992},{"$f":"INTERCEPT(K5:L5,$K$2:$L$2)","v":-3.6649999999999956},{"$f":"SLOPE(L5:M5,$L$2:$M$2)","v":0.27470000000000017},{"$f":"INTERCEPT(L5:M5,$L$2:$M$2)","v":-4.1060000000000123},{"$f":"IF($Z$1>=70,$Z$1*X5+Y5,IF(AND($Z$1>=60,$Z$1<70),V5*$Z$1+W5,IF(AND($Z$1>=50,$Z$1<60),T5*$Z$1+U5,IF(AND($Z$1>=40,$Z$1<50),R5*$Z$1+S5,IF(AND($Z$1>=30,$Z$1<40),P5*$Z$1+Q5,IF(AND($Z$1>0,$Z$1<30),N5*$Z$1+O5,0))))))","v":0},{"$f":"D5","v":0},null,"Rijlabels",null,null,null,null,null,null,null,null,null,{"$f":"D5","v":0}]
[25,"Standard","E",null,"VS-RH50A25","EVS-RH50A25",2.3439999999999999,4.758,7.2409999999999997,9.7929999999999993,12.413,15.1,17.853000000000002,{"$f":"SLOPE(G6:H6,$G$2:$H$2)","v":0.2414},{"$f":"INTERCEPT(G6:H6,$G$2:$H$2)","v":-2.484},{"$f":"SLOPE(H6:I6,$H$2:$I$2)","v":0.24829999999999999},{"$f":"INTERCEPT(H6:I6,$H$2:$I$2)","v":-2.6910000000000007},{"$f":"SLOPE(I6:J6,$I$2:$J$2)","v":0.25519999999999998},{"$f":"INTERCEPT(I6:J6,$I$2:$J$2)","v":-2.9670000000000005},{"$f":"SLOPE(J6:K6,$J$2:$K$2)","v":0.26200000000000012},{"$f":"INTERCEPT(J6:K6,$J$2:$K$2)","v":-3.3070000000000075},{"$f":"SLOPE(K6:L6,$K$2:$L$2)","v":0.26869999999999994},{"$f":"INTERCEPT(K6:L6,$K$2:$L$2)","v":-3.7089999999999961},{"$f":"SLOPE(L6:M6,$L$2:$M$2)","v":0.27530000000000021},{"$f":"INTERCEPT(L6:M6,$L$2:$M$2)","v":-4.1710000000000136},0,0,1,"F-SL200A125",null,null,null,null,null,null,null,null,null,0]
[32,"Standard","E",null,"VS-RH63A32","EVS-RH63A32",2.4260000000000002,4.923,7.492,10.131,12.840999999999999,15.619,18.466000000000001,0.24969999999999998,-2.5679999999999996,0.25689999999999996,-2.7839999999999989,0.26390000000000002,-3.0640000000000001,0.27099999999999991,-3.4189999999999934,0.27780000000000005,-3.8270000000000017,0.28470000000000012,-4.3100000000000094,0,0,2,"VS-R200A125",null,null,null,null,null,null,null,null,null,0]
[40,"Standard","E",null,"VS-RH75A40","EVS-RH75A40",2.6139999999999999,5.3040000000000003,8.07,10.91,13.824,16.811,19.87,0.26900000000000007,-2.7660000000000013,0.27660000000000001,-2.9940000000000007,0.28399999999999997,-3.2899999999999991,0.29139999999999999,-3.66,0.29870000000000002,-4.0980000000000025,0.30590000000000012,-4.602000000000011,0,0,3,null,null,null,null,null,null,null,null,null,null,0]
[50,"Standard","E",null,"VS-RH125A50","EVS-RH125A50",2.0720000000000001,4.2030000000000003,6.3929999999999998,8.641,10.946999999999999,13.311,15.731999999999999,0.21310000000000001,-2.1900000000000004,0.21899999999999994,-2.3669999999999982,0.22480000000000003,-2.599000000000002,0.23059999999999992,-2.8889999999999958,0.23640000000000008,-3.2370000000000054,0.24209999999999993,-3.6359999999999957,0,0,4,null,null,null,null,null,null,null,null,null,null,0]
[63,"Standard","E",null,"VS-RH125A63","EVS-RH125A63",2.754,5.5830000000000002,8.4879999999999995,11.468,14.521000000000001,17.646999999999998,20.846,0.28290000000000004,-2.9040000000000008,0.29049999999999992,-3.131999999999997,0.29800000000000004,-3.4320000000000022,0.30530000000000007,-3.7970000000000024,0.31259999999999977,-4.2349999999999852,0.31990000000000018,-4.7460000000000164,0,0,5,null,null,null,null,null,null,null,null,null,null,0]
{"$rows_left_out":85}
{"sheet":"PRINTOUT","index":5,"n_rows":32,"n_cols":11,"rows_kept":32,"cut":false,"hidden":false,"merged":[]}
[]
[null,{"$f":"CALC!B3","v":"PIPE SIZING FOR SINGLE OR DOUBLE LINES BETWEEN 2 NET POSITIONS"}]
[null,{"$f":"CALC!B4","v":"FLEXALEN - PREINSULATED PIPE SYSTEMS"}]
[null,{"$f":"CALC!B5","v":"MADE FOR DOMESTIC WATER DISTRIBUTION, COOLING AND HEATING SUPPLY LINES"}]
[]
[]
[null,null,null,null,null,null,null,null,{"$f":"CALC!B24","v":"OD (DIMENSION)"},null,{"$f":"CALC!D24","v":16}]
[null,null,null,null,null,null,null,null,{"$f":"CALC!B25","v":"VELOCITY"},null,{"$f":"CALC!D25","v":0}]
[null,"FLEXALEN",null,{"$f":"CALC!H30","v":"HEATING / COOLING (F / R)"},null,null,null,null,{"$f":"CALC!B21","v":"VOLUMETRIC FLOW RATE"},null,{"$f":"CALC!D21","v":0}]
[null,null,null,null,null,null,null,null,{"$f":"CALC!B20","v":"HEAT LOAD kW SOURCE"},null,{"$f":"CALC!D20","v":0}]
{"$rows_left_out":23}
{"sheet":"TEMPERATUR","index":6,"n_rows":28,"n_cols":8,"rows_kept":28,"cut":false,"hidden":true,"merged":[]}
[]
["CALCULATION TEMPERATURE DROP:"]
[]
[null,"Supply line / Heating, Cooling",{"$f":"CALC!G29","v":"D"},"(E or D)"]
[null,"Product choosen",{"$f":"VLOOKUP(CALC!D30,PARAMETER_HL!AB6:AC12,2,FALSE)","v":0}]
[]
[null,null,"PIPE","PIPE"]
[null,null,"FLOW","RETURN"]
["O.D. ","Diameter pipe",{"$f":"CALC!$K$15","v":16},{"$f":"CALC!$K$17","v":16},"mm"]
["ϑ","Temperature medium",{"$f":"CALC!$D$11","v":0},{"$f":"CALC!$D$12","v":0},"°C",{"$f":"C10+D10","v":0}]
{"$rows_left_out":19}
{"sheet":"Language","index":7,"n_rows":101,"n_cols":15,"rows_kept":101,"cut":false,"hidden":true,"merged":[]}
["INDEX","ENGLISH","GERMAN","BULAGRIAN","DUTCH ","FRENCH","ROMANIAN","TURKISH","RUSSIAN","Czech","ITALIAN","HUNGARIAN","CROATIAN","POLISH","ESPAÑOL"]
[1,"PIPE SIZING FOR SINGLE OR DOUBLE LINES BETWEEN 2 NET POSITIONS","ROHRLEITUNGSBERECHNUNG  - VERBINDUNG VON ZWEI NETZPUNKTEN MIT EINZEL- ODER DOPPELLEITUNG","ОРАЗМЕРЯВАНЕ НА ТРЪБОПРОВОД - СЪЕДИНЯВАНЕ НА 2 ТОЧКИ ЧРЕЗ ЕДНО- ИЛИ ДВУТРЪБНА СИСТЕМА","BUISAFMETING VOOR ENKEL OF DUBBEL LEIDINGSYSTEEM VAN A NAAR B","DIMENSIONNEMENT TUBE FLEXALEN LIGNE SIMPLE OU DOUBLE POUR LIAISON ENTRE BATIMENTS ","DIMENSIONARE CONDUCTE CIRCUITE SIMPLE SAU DUBLE INTRE DOUA PUNCTE DIN RETEA","İKİ NOKTA ARASINDAKİ TEKLİ VEYA İKİLİ HATLAR İÇİN BORU EBADI","РАСЧЕТ ДИАМЕТРА ТРУБ ДЛЯ ОДНОТРУБНОЙ ИЛИ ДВУХТРУБНОЙ СИСТЕМ МЕЖДУ ДВУМЯ ТОЧКАМИ","VÝPOČET POTRUBÍ PRO TRUBNÍ VEDENÍ - SPOJENÍ DVOU BODŮJEDNOTRUBNÍM NEBO DVOUTRUBNÍM VEDENÍM","Dimensionamento Tubo per linee singole o doppie tra due punti distinti","Cső méretezése - két pontot összekötő egy/duplavezetékes csőrendszer","DIMENZIONIRANJE CJEVOVODA - SPOJ 2 TOČKE SUSTAVA ( A-B ) - ZA JEDNOCJEVNE ILI DVOCJEVNE SUSTAVE","Program doboru średnic dla rur pojedyńczych i podwójnych FLEXALEN pomiędzy źródłem ciepła i odbiorcą","DIMENSIONAMIENTO DE TUBERIA CON LINEA DOBLE O LINEA SENCILLA PARA CONEXION ENTRE DOS PUNTOS"]
[2,"FLEXALEN - PREINSULATED PIPE SYSTEMS","FLEXALEN - ISOLIERTE ROHRSYSTEME","FLEXALEN - СИСТЕМА ОТ ПРЕДВАРИТЕЛНО ИЗОЛИРАНИ ТРЪБИ","FLEXALEN VOORGEISOLEERD LEIDINGSYSTEEM","FLEXALEN - SYSTEME TUBES PRE-ISOLES","FLEXALEN-SISTEM CONDUCTE PREIZOLATE","FLEXALEN - ÖNYALITIMLI BORU SİSTEMLERİ","FLEXALEN - ПРЕДВАРИТЕЛЬНО ИЗОЛИРОВАННЫЕ ТРУБЫ","FLEXALEN - PŘEDIZOLOVANÉ POTRUBNÍ SYSTÉMY","Flexalen 600 - Sistema di tubi preisolati","Flexalen - előszigetelt csőrendszer","FLEXALEN 600 - PREDIZOLIRANI CIJEVNI SUSTAV","Flexalen - system preizolowanych rur","FLEXALEN - SISTEMA DE TUBERIA PRE AISLADO"]
[3,"MADE FOR DOMESTIC WATER DISTRIBUTION, COOLING AND HEATING SUPPLY LINES","BERECHNUNG GILT FÜR BRAUCHWASSER-, HEIZUNG- UND KÜHLLEITUNGEN","ИЗЧИСЛЕНИЕТО Е ВАЛИДНО ЗА ПИТЕЙНА ВОДА И ЗА ВОДА ПРИГОДНА ЗА ОТОПЛИТЕЛНИ СИСТЕМИ","GESCHIKT VOOR TAPWATER EN WARMTE/KOUDE DISTRIBUTIE","CE PROGRAMME EST DEFINI POUR LE CALCUL DES RESEAUX DE CHAUFFAGE ET DE DISTRIBUTION D'EAU SANITAIRE","FABRICATE PENTRU RETELE DE DISTRIBUTIE A ENERGIEI TERMICE SI APEI MENAJERE ","SICAK-SOĞUK SU TESİSATLARI VE BÖLGESEL  ISITMA  HATLARI İÇİN YAPILMIŞTIR","ЭТОТ РАСЧЕТ СДЕЛАН ДЛЯ СИСТЕМ БЫТОВОГО ВОДОСНАБЖЕНИЯ И ЦЕНТРАЛЬНОГО ОТОПЛЕНИЯ","VYVINUTO PRO ROZVODY VODY A SYSTÉMY DÁLKOVÉHO TOPENÍ ","Prodotto per distribuire acqua sanitaria e reti di teleriscaldamento","Számítások használati és Fűtővís rendszerek esetében érvényesek","IZRAČUN VRIJEDI ZA SANITARNU I NORMALNO KONDICIONIRANU VODU U TOPLOVODNIM SUSTAVIMA GRIJANJA","Przeznaczony do dystrybucji ciepłej wody użytkowej i uzdatnionej wody grzewczej","DISEÑADO PARA APLICACIONES DE DISTRIBUCION DOMESTICA DE AGUA, AGUA HELADA Y CALEFACCION"]
[4,"QUALITY FACTOR","QUALITÄTSFAKTOR","КАЧЕСТВЕН  ФАКТОР","KWALITEITS FACTOR","FACT QUALITE","FACTOR CALITATE","KALİTE FAKTÖRÜ","КАЧЕСТВЕННЫЙ ФАКТОР","FAKTOR JAKOSTI","Fattore Qualità","Minőségi tényező","KVALITATIVNI FAKTOR","Współczynnik jakości","FACTOR CALIDAD"]
[5,"TEMPERATUR FACTOR","TEMPERATURFAKTOR","ТЕМПЕРАТУРЕН  ФАКТОР","TEMPERATUUR FACTOR","FACT TEMPERATURE","FACTOR TEMPERATURA","SICAKLIK FAKTÖRÜ","ТЕМПЕРАТУРНЫЙ ФАКТОР","FAKTOR TEPLOTY","Fattore Temp.","Hőmérsékleti tényező","TEMPERATURNI FAKTOR","Współczynnik temperatury","FACTOR TEMPERATURA"]
[6,"SIZE TUNING","ANPASSUNG DIMENSION","ДИМЕНЗИЯ ЗА НАПАСВАНЕ","OPTIMALISERINGS FACTOR","ADAPTATION DIAMETRE","OPTIMIZARE DIMENSIONARE","BOYUT AYARLAMA","ПОДБОР ДИАМЕТРА","PŘIZPŮSOBENÍ DIMENZE","Sistema di dimensionamento","Méretezés","DIMENZIONIRANJE","Współczynnik doboru średnic","SELECCIÓN DE TAMAÑO"]
[7,"FLOW TEMPERATURE (Tf)","TEMPERATUR VORLAUF  (Tf)","ТЕМПЕРАТУРА ПОДАВАНЕ","AANVOER TEMPERATUUR","TEMPERATURE DEPART","TEMPERATURA TUR","GİDİŞ SICAKLIĞI [°C] Tg","ТЕМПЕРАТУРА В \"ПОДАЧЕ\" (Tп)","TEPLOTA NA PŘÍVOD. VĚTVI  (Tp )","Temp. di andata(Tf)","Előremenő hőmérséklet","TEMP. POL. (Tpolaza)","Temperatura zasilania Tz","TEMPERATURA DE SUMINISTRO (Ts)"]
[8,"RETURN TEMPERATURE (Tr)","TEMPERATUR RÜCKLAUF (Tr)","ВЪЗВРАТЕНА ТЕМПЕРАТУРА","RETOUR TEMPERATUUR","TEMPERATURE RETOUR","TEMPERATURA RETUR","DÖNÜŞ SICAKLIĞI [°C] Td","ТЕМПЕРАТУРА В \"ОБРАТКЕ\" (То)","TEPLOTA NA VRATNÉ VĚTVI (Tv)","Temp. di ritorno(Tr)","Visszatérő hőmérséklet","TEMP. POV. (T povrata)","Temperatura powrotu Tp","TEMPERATURA DE RETORNO (Tr)"]
[9,"TEMP. DIFFERENCE (Tf - Tr)","TEMP. SPREIZUNG (Tf - Tr)","ТЕРМОРАЗЛИКА (захр./връщ.)","TEMPERATUUR VERSCHIL","DELTA T (Td-Tr)","DIFERENTA TEMPERATURA","SICAKLIK FARKI  (Tg - Td)","РАЗНИЦА ТЕМПЕРАТУР (Tп - Tо)","TEPLOTNÍ SPÁD (Tp-Tv)","Differenza di Temp.(Tf-Tr)","Hőmérsékletkülönbség","Δ T (Tpolaza - Tpovrata)","Różnica temperatur (Tz-Tp)","DIFERENCIA DE TEMPERATURA (Ts - Tr)"]
{"$rows_left_out":92}
{"sheet":"Release Info","index":8,"n_rows":22,"n_cols":3,"rows_kept":22,"cut":false,"hidden":true,"merged":[]}
[null,"Flexalen QuickCalc "]
[null,"Flexalen 600"]
[]
["Version","Date","Changes"]
["v8.00 (beta)","2010-02-03","1st multilingual language: english, german, bulgarian, dutch, Heatloss - temperature drop updated / new outlook,..."]
["v8.00 (beta)","2010-02-09","checked by several people and corrected"]
["v8.00","2010-03-23","Sprachen OK: en, ger, ru, bul, dutch, turkish, romanian"]
["v8.01","2010-06-04","Sprachen - Übersetzungsfehler behoben; v [m/s] Tabelle angefügt; Druckstufe neu für 16-110 und 125-225; Instruction en - aktualisiert"]
["v8.10","2010-07-26","TF faktor angepasst von 1,03 auf 1,02 (nicht 1,011 wie beim großen, robusterer Wert)"]
[null,null,"Alle Beschreibungen geändert auf Flexalen anstatt Flexalen 600"]
{"$rows_left_out":12}