{"text_format":"1","workbook":"xlsx","n_sheets":10,"sheets":["INTRO","CALC","HEATLOSS","PARAMETER_R","PARAMETER_HL","PRINTOUT","TEMPERATUR","Language","Release Info","VB"],"not_rendered":{"charts":0,"images":3,"macros":1,"external_links":0,"defined_names":12,"comments":1,"pivot_tables":1},"unopened":[{"sheet":"VB","index":9,"reason":"part_missing"}],"bounds":{"document_bytes":16777216,"sheet_cells":100000,"rows_first":2000,"rows_last":500,"rows_between":2000,"halvings":0,"cell_chars":16384,"cell_head_chars":4096},"cells_cut":0,"cells_raw":0,"read":"whole","date_system":"1900"}

{"sheet":"INTRO","index":0,"n_rows":37,"n_cols":1,"rows_kept":37,"cut":false,"hidden":false,"merged":[]}
[]
[]
[]
[]
[]
[]
[]
[]
[]
[]
[]
[]
[]
[]
[]
[]
[]
[]
[]
[]
[]
[]
[]
[]
[]
["  COPYRIGHT©: 1996-2011 Thermaflex"]
[]
["PIPESIZING A-B (B-A) for MICROSOFT EXCEL 2007 or higher. This Calculation is based on the Material Properties of \"FLEXALEN 600 and FLEXALEN SL\"."]
["COPYRIGHT©: 1999-2011 Thermaflex; PIPESIZING A-B(-B-A) for MICROSOFT EXCEL 2007 or higher. "]
[]
["This Software belongs to THERMAFLEX and may not be copied or transfered to another user without prior approval of Thermaflex. "]
["Please note that despite careful development and stringent tests no software can give a guarantee for total faultless results.  "]
[]
["If you face any problem please contact : academy@thermaflex.com"]
["THERMAFLEX cannot accept any liability for the results or problems with the data or computer."]
["The compatibility of this Software has to be checked by the user prior to the installation."]
["Please check every result to be safe!"]

{"sheet":"CALC","index":1,"n_rows":33,"n_cols":27,"rows_kept":33,"cut":false,"hidden":false,"merged":[[2,1,2,11],[3,1,3,11],[4,1,4,11],[18,8,18,9]]}
["© 1999-2011 THERMAFLEX / Unautorized passing on of the software is forbidden! ",null,null,null,null,null,null,null,null,null,null,null,null,null,null,null,null,null,null,null,null,null,null,null,null,"LANGUAGE","PRODUCT"]
[null,null,null,null,null,null,null,null,null,null,null,null,null,null,null,null,null,null,null,null,null,null,null,null,null,{"$f":"Language!B1","v":"ENGLISH"},{"$f":"IF(PARAMETER_HL!#REF!=\"\",\"\",PARAMETER_HL!#REF!)","v":{"$error":"#REF!"}}]
[null,{"$f":"HLOOKUP($K$32,Language!$B:$Y,2,0)","v":"PIPE SIZING FOR SINGLE OR DOUBLE LINES BETWEEN 2 NET POSITIONS"},null,null,null,null,null,null,null,null,null,null,null,null,null,null,null,null,null,null,null,null,null,null,null,{"$f":"Language!C1","v":"GERMAN"},{"$f":"IF(PARAMETER_HL!#REF!=\"\",\"\",PARAMETER_HL!#REF!)","v":{"$error":"#REF!"}}]
[null,{"$f":"HLOOKUP($K$32,Language!$B:$Y,3,0)","v":"FLEXALEN - PREINSULATED PIPE SYSTEMS"},null,null,null,null,null,null,null,null,null,null,null,null,null,null,null,null,null,null,null,null,null,null,null,{"$f":"Language!D1","v":"BULAGRIAN"},{"$f":"IF(PARAMETER_HL!#REF!=\"\",\"\",PARAMETER_HL!#REF!)","v":{"$error":"#REF!"}}]
[null,{"$f":"HLOOKUP($K$32,Language!$B:$Y,4,0)","v":"MADE FOR DOMESTIC WATER DISTRIBUTION, COOLING AND HEATING SUPPLY LINES"},null,null,null,null,null,null,null,null,null,null,null,null,null,null,null,null,null,null,null,null,null,null,null,{"$f":"Language!E1","v":"DUTCH "},{"$f":"IF(PARAMETER_HL!#REF!=\"\",\"\",PARAMETER_HL!#REF!)","v":{"$error":"#REF!"}}]
[null,null,null,null,null,null,null,null,null,null,null,null,null,null,null,null,null,null,null,null,null,null,null,null,null,{"$f":"Language!F1","v":"FRENCH"},{"$f":"IF(PARAMETER_HL!#REF!=\"\",\"\",PARAMETER_HL!#REF!)","v":{"$error":"#REF!"}}]
[null,null,null,null,null,null,null,null,null,null,null,null,null,null,null,null,null,null,null,null,null,null,null,null,null,{"$f":"Language!G1","v":"ROMANIAN"},{"$f":"IF(PARAMETER_HL!#REF!=\"\",\"\",PARAMETER_HL!#REF!)","v":{"$error":"#REF!"}}]
[null,{"$f":"HLOOKUP($K$32,Language!$A:$Y,51,0)","v":"PLEASE CHOOSE APPLICATION:"},{"$f":"HLOOKUP($K$32,Language!$A:$Y,52,0)","v":"SUPPLY LINE →"},null,null,null,{"$f":"HLOOKUP($K$32,Language!$A:$Y,22,0)","v":"USABLE TEMP. DIFF."},null,{"$f":"IFERROR(IF(G29=\"E\",HLOOKUP($K$32,Language!$A:$Y,36,0),K16-K18),HLOOKUP($K$32,Language!$A:$Y,78,0))","v":"Choose product"},null,null,null,null,null,null,null,null,null,null,null,null,null,null,null,null,{"$f":"Language!H1","v":"TURKISH"},{"$f":"IF(PARAMETER_HL!#REF!=\"\",\"\",PARAMETER_HL!#REF!)","v":{"$error":"#REF!"}}]
[null,null,{"$f":"HLOOKUP($K$32,Language!$A:$Y,53,0)","v":"HEATING / COOLING →"},null,null,null,{"$f":"HLOOKUP($K$32,Language!$A:$Y,23,0)","v":"USABLE LOAD"},null,{"$f":"IFERROR(IF(G29=\"E\",HLOOKUP($K$32,Language!$A:$Y,36,0),TEMPERATUR!C28),HLOOKUP($K$32,Language!$A:$Y,78,0))","v":"Choose product"},null,null,null,null,null,null,null,null,null,null,null,null,null,null,null,null,"RUSSIAN",{"$f":"IF(PARAMETER_HL!#REF!=\"\",\"\",PARAMETER_HL!#REF!)","v":{"$error":"#REF!"}}]
[null,null,null,null,null,null,{"$f":"HLOOKUP($K$32,Language!$A:$Y,24,0)","v":"NET VOLUME"},null,{"$f":"TEMPERATUR!G12","v":0},null,null,null,null,null,null,null,null,null,null,null,null,null,null,null,null,"CZECH",{"$f":"IF(PARAMETER_HL!#REF!=\"\",\"\",PARAMETER_HL!#REF!)","v":{"$error":"#REF!"}}]
[null,{"$f":"IF($G$29=\"D\",HLOOKUP($K$32,Language!$A:$Y,60,0),HLOOKUP($K$32,Language!$A:$Y,55,0))","v":"FLOW TEMPERATURE"},"(Tf)",null,{"$f":"IF($G$29=\"D\",HLOOKUP($K$32,Language!A:Y,71,FALSE),HLOOKUP($K$32,Language!A:Y,66,FALSE))","v":"°C"},null,null,null,null,null,null,null,null,null,null,null,null,null,null,null,null,null,null,null,null,"ITALIAN",{"$f":"IF(PARAMETER_HL!#REF!=\"\",\"\",PARAMETER_HL!#REF!)","v":{"$error":"#REF!"}}]
[null,{"$f":"IF($G$29=\"D\",HLOOKUP($K$32,Language!$A:$Y,61,0),\"\")","v":"RETURN TEMPERATURE"},{"$f":"IF(G29=\"E\",\"\",\"(Tr)\")","v":"(Tr)"},null,{"$f":"IF($G$29=\"D\",HLOOKUP($K$32,Language!A:Y,72,FALSE),\"\")","v":"°C"},null,{"$f":"HLOOKUP($K$32,Language!$A:$Y,25,0)","v":"SOURCE"},{"$f":"PARAMETER_R!C31","v":0},{"$f":"HLOOKUP($K$32,Language!$A:$Y,29,0)","v":"RESERVE PRESSURE FOR PUMP"},null,null,null,null,null,null,null,null,null,null,null,null,null,null,null,null,"CROATIAN",{"$f":"IF(PARAMETER_HL!#REF!=\"\",\"\",PARAMETER_HL!#REF!)","v":{"$error":"#REF!"}}]
[null,{"$f":"HLOOKUP($K$32,Language!A:Y,10,0)","v":"TEMP. DIFFERENCE (Tf - Tr)"},null,{"$f":"IF(G29=\"E\",HLOOKUP($K$32,Language!$A:$Y,36,0),D11-D12)","v":0},"K",null,{"$f":"HLOOKUP($K$32,Language!$A:$Y,26,0)","v":"TEMP. DIFF."},null,{"$f":"HLOOKUP($K$32,Language!$A:$Y,30,0)","v":"Temperature °C"},{"$f":"HLOOKUP($K$32,Language!$A:$Y,31,0)","v":"Pressure loss bar"},{"$f":"HLOOKUP($K$32,Language!$A:$Y,32,0)","v":"Dimension OD"},{"$f":"HLOOKUP($K$32,Language!$A:$Y,33,0)","v":"END POINT"},null,null,null,null,null,null,null,null,null,null,null,null,null,"HUNGARIAN",{"$f":"IF(PARAMETER_HL!#REF!=\"\",\"\",PARAMETER_HL!#REF!)","v":{"$error":"#REF!"}}]
[null,{"$f":"HLOOKUP($K$32,Language!$A:$Y,62,0)","v":"TRENCH LENGTH"},null,null,{"$f":"HLOOKUP($K$32,Language!A:Y,73,FALSE)","v":"m "},null,{"$f":"IF(G29=\"E\",HLOOKUP($K$32,Language!$A:$Y,27,0),D13)","v":0},null,null,null,null,null,null,null,null,null,null,null,null,null,null,null,null,null,null,"POLISH",{"$f":"IF(PARAMETER_HL!#REF!=\"\",\"\",PARAMETER_HL!#REF!)","v":{"$error":"#REF!"}}]
[null,{"$f":"IF($G$29=\"D\",HLOOKUP($K$32,Language!$A:$Y,63,0),HLOOKUP($K$32,Language!$A:$Y,57,0))","v":"HEAT LOAD"},null,null,{"$f":"IF(G29=\"D\",HLOOKUP($K$32,Language!A:Y,74,FALSE),HLOOKUP($K$32,Language!A:Y,68,FALSE))","v":"kW"},null,null,{"$f":"HLOOKUP($K$32,Language!$A:$Y,34,0)","v":"FLOW"},{"$f":"D11","v":0},{"$f":"D26/100000","v":0},{"$f":"D24","v":16},null,null,null,null,null,null,null,null,null,null,null,null,null,null,"ESPAÑOL",{"$f":"IF(PARAMETER_HL!#REF!=\"\",\"\",PARAMETER_HL!#REF!)","v":{"$error":"#REF!"}}]
[null,{"$f":"IF($G$29=\"D\",HLOOKUP($K$32,Language!$A:$Y,64,0),HLOOKUP($K$32,Language!$A:$Y,58,0))","v":"ADDITIONAL PRESSURE FOR PUMP"},null,null,{"$f":"IF($G$29=\"D\",HLOOKUP($K$32,Language!A:Y,69,FALSE),HLOOKUP($K$32,Language!A:Y,75,FALSE))","v":"bar"},null,{"$f":"HLOOKUP($K$32,Language!$A:$Y,28,0)","v":"PUMP"},{"$f":"D11","v":0},null,null,{"$f":"IFERROR(D11-TEMPERATUR!C23,HLOOKUP($K$32,Language!$A:$Y,78,0))","v":"Choose product"},null,null,null,null,null,null,null,null,null,null,null,null,null,null,null,{"$f":"IF(PARAMETER_HL!#REF!=\"\",\"\",PARAMETER_HL!#REF!)","v":{"$error":"#REF!"}}]
[null,null,null,null,null,null,{"$f":"IF(G29=\"E\",J15,J15+J17)+H12","v":0},{"$f":"HLOOKUP($K$32,Language!$A:$Y,35,0)","v":"RETURN"},{"$f":"IF(G29=\"E\",\"------\",D12)","v":0},{"$f":"IFERROR(D27/100000,0)","v":0},{"$f":"IF(G29=\"E\",\"------\",D24)","v":16},null,null,null,null,null,null,null,null,null,null,null,null,null,null,null,{"$f":"IF(PARAMETER_HL!#REF!=\"\",\"\",PARAMETER_HL!#REF!)","v":{"$error":"#REF!"}}]
[null,{"$f":"HLOOKUP($K$32,Language!A:Y,7,0)","v":"SIZE TUNING"},null,1,"x",null,{"$f":"D21 * 3.6","v":0},{"$f":"IF(G29=\"E\",HLOOKUP($K$32,Language!$A:$Y,36,0),D12)","v":0},null,null,{"$f":"IFERROR(IF(G29=\"E\",HLOOKUP($K$32,Language!$A:$Y,36,0),H18+TEMPERATUR!D23),HLOOKUP($K$32,Language!$A:$Y,78,0))","v":"Choose product"},null,null,null,null,null,null,null,null,null,null,null,null,null,null,null,{"$f":"IF(PARAMETER_HL!#REF!=\"\",\"\",PARAMETER_HL!#REF!)","v":{"$error":"#REF!"}}]
[null,null,null,null,null,null,null,null,{"$f":"PARAMETER_R!C28","v":0},null,null,null,null,null,null,null,null,null,null,null,null,null,null,null,null,null,{"$f":"IF(PARAMETER_HL!#REF!=\"\",\"\",PARAMETER_HL!#REF!)","v":{"$error":"#REF!"}}]
[null,{"$f":"HLOOKUP($K$32,Language!A:Y,12,0)","v":"HEAT LOAD kW SOURCE"},null,{"$f":"PARAMETER_R!C29","v":0},"kW",null,null,null,null,null,null,null,null,null,null,null,null,null,null,null,null,null,null,null,null,null,{"$f":"IF(PARAMETER_HL!#REF!=\"\",\"\",PARAMETER_HL!#REF!)","v":{"$error":"#REF!"}}]
[null,{"$f":"HLOOKUP($K$32,Language!A:Y,13,0)","v":"VOLUMETRIC FLOW RATE"},null,{"$f":"IF(G29<>\"E\",IF(D20=0,PARAMETER_R!C30,(D20*1000/(D13* 4196))),IF(PARAMETER_R!C30=0,0.00000000001,PARAMETER_R!C30))","v":0},"l/s",null,{"$f":"HLOOKUP($K$32,Language!$A:$Y,37,0)","v":"Soil temperature"},10,null,{"$f":"HLOOKUP($K$32,Language!$A:$Y,40,0)","v":"Temperature drop Flow"},null,{"$f":"IFERROR(H16-K16,HLOOKUP($K$32,Language!$A:$Y,78,0))","v":"Choose product"},null,null,null,null,null,null,null,null,null,null,null,null,null,null,{"$f":"IF(PARAMETER_HL!#REF!=\"\",\"\",PARAMETER_HL!#REF!)","v":{"$error":"#REF!"}}]
[null,{"$f":"HLOOKUP($K$32,Language!A:Y,14,0)","v":"PIPE LENGTH"},null,{"$f":"IF(G29=\"E\",PARAMETER_R!C28,PARAMETER_R!C28*2)","v":0},"m",null,{"$f":"HLOOKUP($K$32,Language!$A:$Y,38,0)","v":"Coverage"},800,null,{"$f":"HLOOKUP($K$32,Language!$A:$Y,41,0)","v":"Trench Length"},null,{"$f":"PARAMETER_R!C28","v":0}]
[null,null,null,null,null,null,{"$f":"HLOOKUP($K$32,Language!$A:$Y,39,0)","v":"Lambda soil"},1,null,{"$f":"HLOOKUP($K$32,Language!$A:$Y,42,0)","v":"Dwell time Flow"},null,{"$f":"IFERROR(TEMPERATUR!C13,0)","v":0}]
[null,{"$f":"HLOOKUP($K$32,Language!$A:$Y,15,0)","v":"OD (DIMENSION)"},null,{"$f":"IF(D21*D18<PARAMETER_R!$J$7,      PARAMETER_R!$A$7,      LOOKUP(D21*D18,PARAMETER_R!$J$7:$J$20,PARAMETER_R!$A$7:$A$20))","v":16}]
[null,{"$f":"HLOOKUP($K$32,Language!$A:$Y,16,0)","v":"VELOCITY"},null,{"$f":"D21/((LOOKUP(D24,PARAMETER_R!$A$7:$A$20,PARAMETER_R!$B$7:$B$20)/2)^2*PI()*0.001)","v":0},null,null,{"$f":"HLOOKUP($K$32,Language!$A:$Y,43,0)","v":"Pressure rating"},{"$f":"IF(D24>110,6,8)","v":8},{"$f":"HLOOKUP($K$32,Language!$A:$Y,47,0)","v":"at 95°C"}]
[null,{"$f":"HLOOKUP($K$32,Language!$A:$Y,17,0)","v":"PRESSURE DROP FLOW"},null,{"$f":"PARAMETER_R!C28*D25^PARAMETER_R!$B$1*LOOKUP(D24,PARAMETER_R!$A$7:$A$20,PARAMETER_R!$C$7:$C$20)*(PARAMETER_R!$B$2^((90-$D$11)/10))","v":0},null,null,{"$f":"HLOOKUP($K$32,Language!$A:$Y,44,0)","v":"max. Pressure"},{"$f":"PARAMETER_R!G24","v":16.388449863675987},{"$f":"HLOOKUP($K$32,Language!$A:$Y,48,0)","v":"at Service Temperature"}]
[null,{"$f":"HLOOKUP($K$32,Language!$A:$Y,18,0)","v":"PRESSURE DROP RETURN"},null,{"$f":"IF(G29=\"E\",\"------\",PARAMETER_R!C28*D25^PARAMETER_R!$B$1*LOOKUP(D24,PARAMETER_R!$A$7:$A$20,PARAMETER_R!$C$7:$C$20)*(PARAMETER_R!$B$2^((90-D12)/10)))","v":0},null,null,{"$f":"HLOOKUP($K$32,Language!$A:$Y,45,0)","v":"Pressure drop"},{"$f":"J15+J17","v":0},{"$f":"HLOOKUP($K$32,Language!$A:$Y,49,0)","v":"FLEXALEN pipes only"}]
[null,{"$f":"HLOOKUP($K$32,Language!$A:$Y,19,0)","v":"PRESSURE DROP TOTAL"},null,{"$f":"IF(G29=\"E\",D26,D26+D27)","v":0},null,null,{"$f":"HLOOKUP($K$32,Language!$A:$Y,46,0)","v":"Reserve press."},{"$f":"H26-((D28/100000)+H12)","v":16.388449863675987},{"$f":"HLOOKUP($K$32,Language!$A:$Y,50,0)","v":"at Service Temperature"}]
[null,null,null,null,null,null,"D"]
[null,{"$f":"HLOOKUP($K$32,Language!$A:$Y,76,0)","v":"SELECT A FLEXALEN PRODUCT"},null,5,null,null,null,{"$f":"IF(G29=\"E\",HLOOKUP($K$32,Language!B:Y,20,0),HLOOKUP($K$32,Language!B:Y,21,0))","v":"HEATING / COOLING (F / R)"}]
[]
[null,{"$f":"HLOOKUP($K$32,Language!$A:$Y,77,0)","v":"ENERGY LOSS PER m' TRENCH LENGTH"},null,{"$f":"IFERROR(TEMPERATUR!C14+TEMPERATUR!D14,HLOOKUP($K$32,Language!$A:$Y,78,0))","v":"Choose product"},"W/m",null,null,null,null,"LANGUAGE:   ","ENGLISH"]
[null,{"$f":"HLOOKUP($K$32,Language!$A:$Y,79,0)","v":"ENERGY LOSS TOTAL"},null,{"$f":"IFERROR(D32*D14/1000,HLOOKUP($K$32,Language!$A:$Y,78,0))","v":"Choose product"},"kW"]

{"sheet":"HEATLOSS","index":2,"n_rows":10,"n_cols":4,"rows_kept":10,"cut":false,"hidden":true,"merged":[]}
[]
[]
[]
[]
[]
[]
[]
[]
[{"$f":"CALC!#REF!","v":{"$error":"#REF!"}},{"$f":"PARAMETER_R!C28","v":0},{"$f":"CALC!#REF!","v":{"$error":"#REF!"}},{"$f":"B9*C9","v":{"$error":"#REF!"}}]
["Product","Trench length [m]","Heat loss [W/m]","Heat loss total [W]"]

{"sheet":"PARAMETER_R","index":3,"n_rows":31,"n_cols":13,"rows_kept":31,"cut":false,"hidden":true,"merged":[]}
["QF",1.83,"Materialkonstante für Rohrreibung",null,null,null,"KS-Druckkonstante A",null,1.008,"Multiplikator P-D ",null,0.75]
["TF",1.02,"Temperaturkonstante für dyn. Viskosität",null,null,null,"KS Druckkonstante B",null,1E-4,"Begrenzung ab D",null,125]
["Mediumdichte",0.98,"Mediumdichte des Rohrinhaltes",null,null,null,"Bodentemperatur °C",null,10,"max Druck bar Begrenzung",null,10]
["DRUCKVERLUSTE UND GRENZWERTE LAUT DATENBLATT",null,null,null,null,null,"Kunststoff",null,null,"DIMENSIONSFAKTOR"]
["DRUCKVERLUSTTABELLE","DI 1mm",21325,"PaT90/m","RN=",{"$f":"4^(1/7)","v":1.2190136542044754},"Pmax=",8,null,1,"ENTSPRICHT"]
["TYP","DI","PaT90/m","l/sec max","l/sec opt","L/sec min","v/min","V/max","V/optimal","AUSWAHL","Vmax"]
[16,11.6,{"$f":"$C$5/(B7^$F$5)","v":1074.7320903645364},{"$f":"((B7/2)^2*3.14*H7)/1000","v":9.2954048000000011E-2},{"$f":"((B7/2)^2*3.14*I7)/1000","v":6.3905908000000011E-2},{"$f":"((B7/2)^2*3.14*G7)/1000","v":3.1688880000000003E-3},0.03,0.88,0.60500000000000009,0.01,{"$f":"(J8*1000)/((B7/2)^2*3.14)","v":1.0714863258026162}]
[20,14.4,{"$f":"$C$5/(B8^$F$5)","v":825.71342453276043},0.17905536000000002,0.11638598400000003,4.5577728000000005E-2,0.28000000000000003,1.1000000000000001,0.71500000000000008,0.11318067200000002,1.3921875000000001]
[25,20.399999999999999,{"$f":"$C$5/(B9^$F$5)","v":540.04752961653776},0.39528957600000003,0.25873499519999998,0.10453939199999999,0.32,1.2100000000000002,0.79200000000000004,0.22661694000000002,1.2100000000000002]
[32,26,401.80673157834582,0.70047119999999996,0.4582249100000001,0.19634419999999997,0.37,1.32,0.86350000000000016,0.39528957600000003,{"$f":"(J11*1000)/((B10/2)^2*3.14)","v":1.32}]
[40,32.6,304.9693004628171,1.1930012380000004,0.80298160250000017,0.37541997000000005,0.45,1.4300000000000002,0.96250000000000013,0.70047119999999996,1.4300000000000004,null,"ARBEITSBEREICH enspricht rotem Bereich!!"]
[50,40.799999999999997,231.99162596060424,2.0123832959999999,1.3655458079999998,0.65337119999999993,0.5,1.54,1.0449999999999999,1.1930012380000004,1.54]
[63,51.5,174.6516344511125,3.6643486000000007,2.5192396625000004,1.2492097499999999,0.6,1.7600000000000002,1.2100000000000002,2.0123832959999999,1.7600000000000002]
[75,61.2,141.51897017383027,5.8215373920000015,3.9618796140000008,1.9111107600000004,0.65,1.9800000000000002,1.3475000000000001,3.6643486000000007,1.98]
[90,73.599999999999994,113.0158858314764,9.3550899200000011,6.4316243200000001,3.1892351999999997,0.75,2.2000000000000002,1.5125000000000002,5.8215373920000015,2.2000000000000002]
[110,90,88.43837156190547,16.087004999999998,11.016101250000002,5.4047249999999991,0.85,2.5299999999999998,1.7325000000000002,9.3550899200000011,2.5299999999999998]
[125,102.2,75.742731052911211,22.547798350000004,15.332502878000003,7.3792794600000011,0.9,2.75,1.87,16.087004999999998,2.75]
[140,114.6,65.874127253098592,29.485257515999997,20.412870587999997,10.309530599999999,1,2.8600000000000003,1.9800000000000002,22.547798350000004,2.8600000000000003]
[160,130.80000000000001,56.068030294156699,42.842600856000011,29.546621280000011,14.773310640000005,1.1000000000000001,3.19,2.2000000000000002,29.485257515999997,3.19]
[225,184,36.986666322575978,105.24476160000003,73.086640000000017,37.207743999999998,1.4,3.9600000000000004,2.75,42.842600856000011,{"$f":"K19*(H20/H19)","v":3.96}]
[250,205,32.421232308136979,145.15434999999999,97.979186250000026,46.185474999999997,1.4,4.4000000000000004,2.9700000000000006,105.24476160000003]
[]
[]
[null,null,{"$f":"CALC!G29","v":"D"},null,"Pmax calc =",null,{"$f":"IF(CALC!D24<L2,IF(I1=0,H5,(I1+(C25*I2))^(90-C25)*H5),G25)","v":16.388449863675987},"bar"]
["TEMPERATUR VORLAUF",null,{"$f":"IF($C$24=\"E\",CALC!D11,CALC!D11)","v":0},null,"Pmax calc limit=",null,{"$f":"IF(((I1+(C25*I2))^(90-C25)*H5)*L1<L3,((I1+(C25*I2))^(90-C25)*H5)*L1,L3)","v":10},"bar"]
["TEMPERATUR RÜCKLAUF",null,{"$f":"IF($C$24=\"E\",0,CALC!D12)","v":0}]
["SPREIZUNG",null,{"$f":"IF($C$24=\"E\",0,CALC!D13)","v":0}]
["TRASSENLÄNGE",null,{"$f":"CALC!D14","v":0}]
["LEISTUNG kW",null,{"$f":"IF($C$24=\"E\",0,CALC!D15)","v":0}]
["MEDIUMMENGE",null,{"$f":"IF($C$24=\"E\",CALC!D15,0)","v":0}]
["VORDRUCK für Pumpe",null,{"$f":"CALC!D16","v":0}]

{"sheet":"PARAMETER_HL","index":4,"n_rows":94,"n_cols":39,"rows_kept":94,"cut":false,"hidden":true,"merged":[[0,23,0,24],[1,13,1,14],[1,15,1,16],[1,17,1,18],[1,19,1,20],[1,21,1,22],[1,23,1,24]]}
[{"$f":"CALC!D24","v":16},{"$f":"CALC!G29","v":"D"},null,null,1,2,3,4,5,6,7,8,9,10,11,12,13,14,15,16,17,18,19,"Temperature =",null,{"$f":"IF(CALC!G29=\"E\",CALC!D11,(CALC!D11+CALC!D12)/2)","v":0}]
[null,null,null,null,null,null,20,30,40,50,60,70,80,"20-30",null,"30-40",null,"40-50",null,"50-60",null,"60-70",null,"70-max",null,"f=ϑ.x+d",null,null,"O.D. [mm]",125]
["O.D. [mm]","TF Range","Type",2,"TF code","help",20,30,40,50,60,70,80,"x","d",null,null,null,null,null,null,null,null,null,null,"[W/m]",null,null,"Type","D"]
[16,"Standard","E",null,"VS-RH40A16",{"$f":"C4&E4","v":"EVS-RH40A16"},1.794,3.6440000000000001,5.548,7.5069999999999997,9.5190000000000001,11.585000000000001,13.704000000000001,{"$f":"SLOPE(G4:H4,$G$2:$H$2)","v":0.185},{"$f":"INTERCEPT(G4:H4,$G$2:$H$2)","v":-1.9059999999999997},{"$f":"SLOPE(H4:I4,$H$2:$I$2)","v":0.19039999999999999},{"$f":"INTERCEPT(H4:I4,$H$2:$I$2)","v":-2.0679999999999996},{"$f":"SLOPE(I4:J4,$I$2:$J$2)","v":0.19589999999999996},{"$f":"INTERCEPT(I4:J4,$I$2:$J$2)","v":-2.2879999999999985},{"$f":"SLOPE(J4:K4,$J$2:$K$2)","v":0.20120000000000005},{"$f":"INTERCEPT(J4:K4,$J$2:$K$2)","v":-2.5530000000000026},{"$f":"SLOPE(K4:L4,$K$2:$L$2)","v":0.20660000000000006},{"$f":"INTERCEPT(K4:L4,$K$2:$L$2)","v":-2.8770000000000042},{"$f":"SLOPE(L4:M4,$L$2:$M$2)","v":0.21189999999999998},{"$f":"INTERCEPT(L4:M4,$L$2:$M$2)","v":-3.2479999999999976},{"$f":"IF($Z$1>=70,$Z$1*X4+Y4,IF(AND($Z$1>=60,$Z$1<70),V4*$Z$1+W4,IF(AND($Z$1>=50,$Z$1<60),T4*$Z$1+U4,IF(AND($Z$1>=40,$Z$1<50),R4*$Z$1+S4,IF(AND($Z$1>=30,$Z$1<40),P4*$Z$1+Q4,IF(AND($Z$1>0,$Z$1<30),N4*$Z$1+O4,0))))))","v":0},{"$f":"D4","v":0},null,null,null,null,null,null,null,null,null,null,null,{"$f":"D4","v":0}]
[20,"Standard","E",null,"VS-RH40A20","EVS-RH40A20",2.3540000000000001,4.7759999999999998,7.2640000000000002,9.8190000000000008,12.439,15.122999999999999,17.87,{"$f":"SLOPE(G5:H5,$G$2:$H$2)","v":0.2422},{"$f":"INTERCEPT(G5:H5,$G$2:$H$2)","v":-2.4899999999999998},{"$f":"SLOPE(H5:I5,$H$2:$I$2)","v":0.24880000000000002},{"$f":"INTERCEPT(H5:I5,$H$2:$I$2)","v":-2.6880000000000006},{"$f":"SLOPE(I5:J5,$I$2:$J$2)","v":0.25550000000000006},{"$f":"INTERCEPT(I5:J5,$I$2:$J$2)","v":-2.9560000000000013},{"$f":"SLOPE(J5:K5,$J$2:$K$2)","v":0.2619999999999999},{"$f":"INTERCEPT(J5:K5,$J$2:$K$2)","v":-3.2809999999999935},{"$f":"SLOPE(K5:L5,$K$2:$L$2)","v":0.26839999999999992},{"$f":"INTERCEPT(K5:L5,$K$2:$L$2)","v":-3.6649999999999956},{"$f":"SLOPE(L5:M5,$L$2:$M$2)","v":0.27470000000000017},{"$f":"INTERCEPT(L5:M5,$L$2:$M$2)","v":-4.1060000000000123},{"$f":"IF($Z$1>=70,$Z$1*X5+Y5,IF(AND($Z$1>=60,$Z$1<70),V5*$Z$1+W5,IF(AND($Z$1>=50,$Z$1<60),T5*$Z$1+U5,IF(AND($Z$1>=40,$Z$1<50),R5*$Z$1+S5,IF(AND($Z$1>=30,$Z$1<40),P5*$Z$1+Q5,IF(AND($Z$1>0,$Z$1<30),N5*$Z$1+O5,0))))))","v":0},{"$f":"D5","v":0},null,"Rijlabels",null,null,null,null,null,null,null,null,null,{"$f":"D5","v":0}]
[25,"Standard","E",null,"VS-RH50A25","EVS-RH50A25",2.3439999999999999,4.758,7.2409999999999997,9.7929999999999993,12.413,15.1,17.853000000000002,{"$f":"SLOPE(G6:H6,$G$2:$H$2)","v":0.2414},{"$f":"INTERCEPT(G6:H6,$G$2:$H$2)","v":-2.484},{"$f":"SLOPE(H6:I6,$H$2:$I$2)","v":0.24829999999999999},{"$f":"INTERCEPT(H6:I6,$H$2:$I$2)","v":-2.6910000000000007},{"$f":"SLOPE(I6:J6,$I$2:$J$2)","v":0.25519999999999998},{"$f":"INTERCEPT(I6:J6,$I$2:$J$2)","v":-2.9670000000000005},{"$f":"SLOPE(J6:K6,$J$2:$K$2)","v":0.26200000000000012},{"$f":"INTERCEPT(J6:K6,$J$2:$K$2)","v":-3.3070000000000075},{"$f":"SLOPE(K6:L6,$K$2:$L$2)","v":0.26869999999999994},{"$f":"INTERCEPT(K6:L6,$K$2:$L$2)","v":-3.7089999999999961},{"$f":"SLOPE(L6:M6,$L$2:$M$2)","v":0.27530000000000021},{"$f":"INTERCEPT(L6:M6,$L$2:$M$2)","v":-4.1710000000000136},0,0,1,"F-SL200A125",null,null,null,null,null,null,null,null,null,0]
[32,"Standard","E",null,"VS-RH63A32","EVS-RH63A32",2.4260000000000002,4.923,7.492,10.131,12.840999999999999,15.619,18.466000000000001,0.24969999999999998,-2.5679999999999996,0.25689999999999996,-2.7839999999999989,0.26390000000000002,-3.0640000000000001,0.27099999999999991,-3.4189999999999934,0.27780000000000005,-3.8270000000000017,0.28470000000000012,-4.3100000000000094,0,0,2,"VS-R200A125",null,null,null,null,null,null,null,null,null,0]
[40,"Standard","E",null,"VS-RH75A40","EVS-RH75A40",2.6139999999999999,5.3040000000000003,8.07,10.91,13.824,16.811,19.87,0.26900000000000007,-2.7660000000000013,0.27660000000000001,-2.9940000000000007,0.28399999999999997,-3.2899999999999991,0.29139999999999999,-3.66,0.29870000000000002,-4.0980000000000025,0.30590000000000012,-4.602000000000011,0,0,3,null,null,null,null,null,null,null,null,null,null,0]
[50,"Standard","E",null,"VS-RH125A50","EVS-RH125A50",2.0720000000000001,4.2030000000000003,6.3929999999999998,8.641,10.946999999999999,13.311,15.731999999999999,0.21310000000000001,-2.1900000000000004,0.21899999999999994,-2.3669999999999982,0.22480000000000003,-2.599000000000002,0.23059999999999992,-2.8889999999999958,0.23640000000000008,-3.2370000000000054,0.24209999999999993,-3.6359999999999957,0,0,4,null,null,null,null,null,null,null,null,null,null,0]
[63,"Standard","E",null,"VS-RH125A63","EVS-RH125A63",2.754,5.5830000000000002,8.4879999999999995,11.468,14.521000000000001,17.646999999999998,20.846,0.28290000000000004,-2.9040000000000008,0.29049999999999992,-3.131999999999997,0.29800000000000004,-3.4320000000000022,0.30530000000000007,-3.7970000000000024,0.31259999999999977,-4.2349999999999852,0.31990000000000018,-4.7460000000000164,0,0,5,null,null,null,null,null,null,null,null,null,null,0]
[75,"Standard","E",null,"VS-RH125A75","EVS-RH125A75",3.673,7.4429999999999996,11.307,15.265000000000001,19.315000000000001,23.457999999999998,27.69,0.37699999999999995,-3.8669999999999991,0.38640000000000008,-4.1490000000000027,0.39579999999999999,-4.5249999999999986,0.40500000000000008,-4.9850000000000065,0.41429999999999972,-5.5429999999999851,0.4232000000000003,-6.1660000000000252,0,0,6,null,null,null,null,null,null,null,null,null,null,0]
[90,"Standard","E",null,"VS-RH160A90","EVS-RH160A90",3.2040000000000002,6.4889999999999999,9.8550000000000004,13.298999999999999,16.823,20.425000000000001,24.103999999999999,0.32849999999999996,-3.3659999999999988,0.33660000000000001,-3.609,0.34439999999999993,-3.9209999999999976,0.3524000000000001,-4.3210000000000051,0.36020000000000002,-4.7889999999999979,0.36789999999999984,-5.3279999999999887,0,0,7,null,null,null,null,null,null,null,null,null,null,0]
[110,"Standard","E",null,"VS-R200A110","EVS-R200A110",3.3860000000000001,6.85,10.393000000000001,14.012,17.707999999999998,21.478999999999999,25.326000000000001,0.34639999999999993,-3.541999999999998,0.35430000000000006,-3.7790000000000017,0.3619,-4.0829999999999984,0.36959999999999982,-4.4679999999999893,0.3771000000000001,-4.9180000000000064,0.38470000000000015,-5.4500000000000099,0,0,null,null,null,null,null,null,null,null,null,null,null,0]
[125,"Standard","E",null,"VS-R200A125","EVS-R200A125",4.1139999999999999,8.3230000000000004,12.624000000000001,17.018000000000001,21.503,26.077999999999999,30.742999999999999,0.42090000000000005,-4.3040000000000003,0.43010000000000004,-4.58,0.43939999999999996,-4.9519999999999982,0.44849999999999995,-5.4069999999999965,0.45749999999999991,-5.9469999999999921,0.46649999999999991,-6.5769999999999982,0,0,null,null,null,null,null,null,null,null,null,null,null,0]
[140,"Standard","E",null,"FV-R225A140","EFV-R225A140",3.89,7.6639999999999997,11.436999999999999,15.211,18.984999999999999,22.757999999999999,26.532,0.37739999999999996,-3.6579999999999986,0.37729999999999997,-3.6549999999999994,0.37740000000000007,-3.6590000000000042,0.37739999999999996,-3.6589999999999989,0.37729999999999997,-3.6529999999999987,0.37740000000000007,-3.6600000000000072,0,0,null,null,null,null,null,null,null,null,null,null,null,0]
[160,"Standard","E",null,"FV-R250A160","EFV-R250A160",4.319,8.1850000000000005,12.05,15.916,19.780999999999999,23.646999999999998,27.512,0.38660000000000005,-3.4130000000000003,0.38650000000000007,-3.4100000000000019,0.38659999999999994,-3.4139999999999979,0.38649999999999984,-3.4089999999999918,0.38659999999999994,-3.4149999999999991,0.38650000000000018,-3.4080000000000155,0,0,null,null,null,null,null,null,null,null,null,null,null,0]
[225,"Standard","E",null,"FV-R315A225","EFV-R315A225",5.54,10.45,15.359,20.268999999999998,25.178000000000001,30.088000000000001,34.997,0.49099999999999994,-4.2799999999999994,0.49090000000000006,-4.2770000000000046,0.49099999999999983,-4.2809999999999917,0.49090000000000023,-4.2760000000000105,0.49099999999999999,-4.2819999999999965,0.49089999999999989,-4.2749999999999915,0,0,null,null,null,null,null,null,null,null,null,null,null,0]
[16,"DHC","E",null,"VS-RH75A16","EVS-RH75A16",1.1020000000000001,2.2389999999999999,3.4119999999999999,4.62,5.8620000000000001,7.14,8.452,0.11369999999999997,-1.1719999999999993,0.1173,-1.2800000000000002,0.12080000000000002,-1.4200000000000008,0.1242,-1.5900000000000007,0.12779999999999997,-1.8059999999999992,0.13120000000000004,-2.044000000000004,0,0,null,null,null,null,null,null,null,null,null,null,null,0]
[20,"DHC","E",null,"VS-RH90A20","EVS-RH90A20",1.175,2.387,3.6360000000000001,4.9210000000000003,6.242,7.5990000000000002,8.9920000000000009,0.12119999999999999,-1.2489999999999997,0.12490000000000002,-1.3600000000000012,0.1285,-1.5039999999999996,0.13209999999999997,-1.6839999999999984,0.13570000000000002,-1.9000000000000004,0.13930000000000006,-2.1520000000000046,0,0,null,null,null,null,null,null,null,null,null,null,null,0]
[25,"DHC","E",null,"VS-RH90A25","EVS-RH90A25",1.39,2.8239999999999998,4.3019999999999996,5.8220000000000001,7.3849999999999998,8.99,10.638,0.1434,-1.4780000000000002,0.14779999999999999,-1.6099999999999994,0.15200000000000005,-1.7780000000000031,0.15629999999999997,-1.9929999999999986,0.16050000000000003,-2.2450000000000028,0.16479999999999997,-2.5459999999999976,0,0,null,null,null,null,null,null,null,null,null,null,null,0]
[32,"DHC","E",null,"VS-RH125A32","EVS-RH125A32",1.411,2.863,4.3570000000000002,5.8920000000000003,7.4690000000000003,9.0860000000000003,10.743,0.1452,-1.4929999999999999,0.14940000000000001,-1.6189999999999998,0.15350000000000003,-1.7830000000000013,0.15770000000000001,-1.9930000000000003,0.16170000000000001,-2.2330000000000005,0.16570000000000001,-2.5129999999999999,0,0,null,null,null,null,null,null,null,null,null,null,null,0]
[40,"DHC","E",null,"VS-RH125A40","EVS-RH125A40",1.6779999999999999,3.4049999999999998,5.181,7.0049999999999999,8.8770000000000007,10.795999999999999,12.763,0.17269999999999999,-1.7759999999999998,0.17760000000000001,-1.923,0.18239999999999998,-2.1149999999999984,0.18720000000000006,-2.3550000000000022,0.19189999999999988,-2.6369999999999916,0.19670000000000004,-2.9730000000000043,0,0,null,null,null,null,null,null,null,null,null,null,null,0]
[50,"DHC","E",null,"VS-RH160A50","EVS-RH160A50",1.73,3.5059999999999998,5.327,7.1929999999999996,9.1050000000000004,11.06,13.06,0.17759999999999998,-1.8219999999999996,0.18210000000000001,-1.9570000000000007,0.18659999999999996,-2.1369999999999987,0.19120000000000009,-2.3670000000000044,0.19550000000000001,-2.625,0.2,-2.9399999999999995,0,0,null,null,null,null,null,null,null,null,null,null,null,0]
[63,"DHC","E",null,"VS-RH160A63","EVS-RH160A63",2.109,4.2729999999999997,6.4909999999999997,8.7639999999999993,11.09,13.47,15.904,0.21639999999999998,-2.2189999999999994,0.2218,-2.3810000000000002,0.22729999999999997,-2.6009999999999991,0.23260000000000006,-2.8660000000000032,0.23800000000000007,-3.1900000000000031,0.24339999999999992,-3.5679999999999943,0,0,null,null,null,null,null,null,null,null,null,null,null,0]
[75,"DHC","E",null,"VS-RH160A75","EVS-RH160A75",2.5209999999999999,5.1059999999999999,7.7560000000000002,10.47,13.247999999999999,16.088999999999999,18.992000000000001,0.25850000000000001,-2.6490000000000005,0.26500000000000001,-2.8440000000000003,0.27140000000000003,-3.1000000000000014,0.27779999999999988,-3.4199999999999928,0.28409999999999991,-3.7979999999999947,0.29030000000000022,-4.2320000000000135,0,0,null,null,null,null,null,null,null,null,null,null,null,0]
[125,"DHC","E",null,"F-SL200A125","EF-SL200A125",4.1139999999999999,8.3230000000000004,12.624000000000001,17.018000000000001,21.503,26.077999999999999,30.742999999999999,0.42090000000000005,-4.3040000000000003,0.43010000000000004,-4.58,0.43939999999999996,-4.9519999999999982,0.44849999999999995,-5.4069999999999965,0.45749999999999991,-5.9469999999999921,0.46649999999999991,-6.5769999999999982,0,0]
[32,"+31","E",null,"VS-RH90A32","EVS-RH90A32",1.7130000000000001,3.4790000000000001,5.2969999999999997,7.1669999999999998,9.0879999999999992,11.061,13.084,0.17660000000000001,-1.819,0.18179999999999996,-1.9749999999999988,0.18700000000000003,-2.1830000000000016,0.19209999999999994,-2.4379999999999971,0.19730000000000009,-2.7500000000000053,0.20229999999999998,-3.0999999999999979,0,0]
[40,"+31","E",null,"VS-RH90A40","EVS-RH90A40",2.1680000000000001,4.4009999999999998,6.6980000000000004,9.0579999999999998,11.48,13.965999999999999,16.513000000000002,0.22329999999999997,-2.2979999999999996,0.22970000000000007,-2.490000000000002,0.23599999999999993,-2.7419999999999973,0.24220000000000005,-3.0520000000000032,0.24859999999999988,-3.4359999999999928,0.25470000000000026,-3.8630000000000209,0,0]
[16,null,"E",null,"VS-RS40A16","EVS-RS40A16",1.794,3.6440000000000001,5.548,7.5069999999999997,9.5190000000000001,11.585000000000001,13.704000000000001,{"$f":"SLOPE(G29:H29,$G$2:$H$2)","v":0.185},{"$f":"INTERCEPT(G29:H29,$G$2:$H$2)","v":-1.9059999999999997},{"$f":"SLOPE(H29:I29,$H$2:$I$2)","v":0.19039999999999999},{"$f":"INTERCEPT(H29:I29,$H$2:$I$2)","v":-2.0679999999999996},{"$f":"SLOPE(I29:J29,$I$2:$J$2)","v":0.19589999999999996},{"$f":"INTERCEPT(I29:J29,$I$2:$J$2)","v":-2.2879999999999985},{"$f":"SLOPE(J29:K29,$J$2:$K$2)","v":0.20120000000000005},{"$f":"INTERCEPT(J29:K29,$J$2:$K$2)","v":-2.5530000000000026},{"$f":"SLOPE(K29:L29,$K$2:$L$2)","v":0.20660000000000006},{"$f":"INTERCEPT(K29:L29,$K$2:$L$2)","v":-2.8770000000000042},{"$f":"SLOPE(L29:M29,$L$2:$M$2)","v":0.21189999999999998},{"$f":"INTERCEPT(L29:M29,$L$2:$M$2)","v":-3.2479999999999976},{"$f":"IF($Z$1>=70,$Z$1*X29+Y29,IF(AND($Z$1>=60,$Z$1<70),V29*$Z$1+W29,IF(AND($Z$1>=50,$Z$1<60),T29*$Z$1+U29,IF(AND($Z$1>=40,$Z$1<50),R29*$Z$1+S29,IF(AND($Z$1>=30,$Z$1<40),P29*$Z$1+Q29,IF(AND($Z$1>0,$Z$1<30),N29*$Z$1+O29,0))))))","v":0},0,null,null,null,null,null,null,null,null,null,null,null,0]
[20,null,"E",null,"VS-RS40A20","EVS-RS40A20",2.3540000000000001,4.7759999999999998,7.2640000000000002,9.8190000000000008,12.439,15.122999999999999,17.87,0.2422,-2.4899999999999998,0.24880000000000002,-2.6880000000000006,0.25550000000000006,-2.9560000000000013,0.2619999999999999,-3.2809999999999935,0.26839999999999992,-3.6649999999999956,0.27470000000000017,-4.1060000000000123,0,0,null,null,null,null,null,null,null,null,null,null,null,0]
[25,null,"E",null,"VS-RS50A25","EVS-RS50A25",2.3439999999999999,4.758,7.2409999999999997,9.7929999999999993,12.413,15.1,17.853000000000002,0.2414,-2.484,0.24829999999999999,-2.6910000000000007,0.25519999999999998,-2.9670000000000005,0.26200000000000012,-3.3070000000000075,0.26869999999999994,-3.7089999999999961,0.27530000000000021,-4.1710000000000136,0,0,null,null,null,null,null,null,null,null,null,null,null,0]
[32,null,"E",null,"VS-RS63A32","EVS-RS63A32",2.4260000000000002,4.923,7.492,10.131,12.840999999999999,15.619,18.466000000000001,0.24969999999999998,-2.5679999999999996,0.25689999999999996,-2.7839999999999989,0.26390000000000002,-3.0640000000000001,0.27099999999999991,-3.4189999999999934,0.27780000000000005,-3.8270000000000017,0.28470000000000012,-4.3100000000000094,0,0,null,null,null,null,null,null,null,null,null,null,null,0]
[40,null,"E",null,"VS-RS75A40","EVS-RS75A40",2.6139999999999999,5.3040000000000003,8.07,10.91,13.824,16.811,19.87,0.26900000000000007,-2.7660000000000013,0.27660000000000001,-2.9940000000000007,0.28399999999999997,-3.2899999999999991,0.29139999999999999,-3.66,0.29870000000000002,-4.0980000000000025,0.30590000000000012,-4.602000000000011,0,0,null,null,null,null,null,null,null,null,null,null,null,0]
[50,null,"E",null,"VS-RS90A50","EVS-RS90A50",2.9649999999999999,6.0140000000000002,9.1449999999999996,12.358000000000001,15.651,19.024000000000001,22.475999999999999,0.3049,-3.1330000000000009,0.31309999999999993,-3.3789999999999978,0.32130000000000009,-3.7070000000000043,0.32929999999999993,-4.1069999999999958,0.3373000000000001,-4.5870000000000068,0.34519999999999984,-5.1399999999999864,0,0,null,null,null,null,null,null,null,null,null,null,null,0]
[63,null,"E",null,"VS-RS125A63","EVS-RS125A63",2.754,5.5830000000000002,8.4879999999999995,11.468,14.521000000000001,17.646999999999998,20.846,0.28290000000000004,-2.9040000000000008,0.29049999999999992,-3.131999999999997,0.29800000000000004,-3.4320000000000022,0.30530000000000007,-3.7970000000000024,0.31259999999999977,-4.2349999999999852,0.31990000000000018,-4.7460000000000164,0,0,null,null,null,null,null,null,null,null,null,null,null,0]
[75,null,"E",null,"VS-RS125A75","EVS-RS125A75",3.673,7.4429999999999996,11.307,15.265000000000001,19.315000000000001,23.457999999999998,27.69,0.37699999999999995,-3.8669999999999991,0.38640000000000008,-4.1490000000000027,0.39579999999999999,-4.5249999999999986,0.40500000000000008,-4.9850000000000065,0.41429999999999972,-5.5429999999999851,0.4232000000000003,-6.1660000000000252,0,0,null,null,null,null,null,null,null,null,null,null,null,0]
[90,null,"E",null,"VS-RS160A90","EVS-RS160A90",3.2040000000000002,6.4889999999999999,9.8550000000000004,13.298999999999999,16.823,20.425000000000001,24.103999999999999,0.32849999999999996,-3.3659999999999988,0.33660000000000001,-3.609,0.34439999999999993,-3.9209999999999976,0.3524000000000001,-4.3210000000000051,0.36020000000000002,-4.7889999999999979,0.36789999999999984,-5.3279999999999887,0,0,null,null,null,null,null,null,null,null,null,null,null,0]
[25,null,"E",null,"VS-RS90A25","EVS-RS90A25",1.39,2.8239999999999998,4.3019999999999996,5.8220000000000001,7.3849999999999998,8.99,10.638,0.1434,-1.4780000000000002,0.14779999999999999,-1.6099999999999994,0.15200000000000005,-1.7780000000000031,0.15629999999999997,-1.9929999999999986,0.16050000000000003,-2.2450000000000028,0.16479999999999997,-2.5459999999999976,0,0,null,null,null,null,null,null,null,null,null,null,null,0]
[32,null,"E",null,"VS-RS125A32",{"$f":"C39&E39","v":"EVS-RS125A32"},1.411,2.863,4.3570000000000002,5.8920000000000003,7.4690000000000003,9.0860000000000003,10.743,0.1452,-1.4929999999999999,0.14940000000000001,-1.6189999999999998,0.15350000000000003,-1.7830000000000013,0.15770000000000001,-1.9930000000000003,0.16170000000000001,-2.2330000000000005,0.16570000000000001,-2.5129999999999999,0,0,null,null,null,null,null,null,null,null,null,null,null,0]
[40,null,"E",null,"VS-RS125A40","EVS-RS125A40",1.6779999999999999,3.4049999999999998,5.181,7.0049999999999999,8.8770000000000007,10.795999999999999,12.763,0.17269999999999999,-1.7759999999999998,0.17760000000000001,-1.923,0.18239999999999998,-2.1149999999999984,0.18720000000000006,-2.3550000000000022,0.19189999999999988,-2.6369999999999916,0.19670000000000004,-2.9730000000000043,0,0,null,null,null,null,null,null,null,null,null,null,null,0]
[50,null,"E",null,"VS-RS160A50","EVS-RS160A50",1.73,3.5059999999999998,5.327,7.1929999999999996,9.1050000000000004,11.06,13.06,0.17759999999999998,-1.8219999999999996,0.18210000000000001,-1.9570000000000007,0.18659999999999996,-2.1369999999999987,0.19120000000000009,-2.3670000000000044,0.19550000000000001,-2.625,0.2,-2.9399999999999995,0,0,null,null,null,null,null,null,null,null,null,null,null,0]
[63,null,"E",null,"VS-RS160A63","EVS-RS160A63",2.109,4.2729999999999997,6.4909999999999997,8.7639999999999993,11.09,13.47,15.904,0.21639999999999998,-2.2189999999999994,0.2218,-2.3810000000000002,0.22729999999999997,-2.6009999999999991,0.23260000000000006,-2.8660000000000032,0.23800000000000007,-3.1900000000000031,0.24339999999999992,-3.5679999999999943,0,0,null,null,null,null,null,null,null,null,null,null,null,0]
[75,null,"E",null,"VS-RS160A75",{"$f":"C43&E43","v":"EVS-RS160A75"},2.5209999999999999,5.1059999999999999,7.7560000000000002,10.47,13.247999999999999,16.088999999999999,18.992000000000001,0.25850000000000001,-2.6490000000000005,0.26500000000000001,-2.8440000000000003,0.27140000000000003,-3.1000000000000014,0.27779999999999988,-3.4199999999999928,0.28409999999999991,-3.7979999999999947,0.29030000000000022,-4.2320000000000135,0,0,null,null,null,null,null,null,null,null,null,null,null,{"$f":"D43","v":0}]
[16,"Standard","D","SP","VS-RH40A16","DVS-RH40A16",3.3759999999999999,6.7809999999999997,10.279,13.868,17.731999999999999,21.312999999999999,25.167999999999999,{"$f":"SLOPE(G44:H44,$G$2:$H$2)","v":0.34049999999999997},{"$f":"INTERCEPT(G44:H44,$G$2:$H$2)","v":-3.4339999999999993},{"$f":"SLOPE(H44:I44,$H$2:$I$2)","v":0.34980000000000006},{"$f":"INTERCEPT(H44:I44,$H$2:$I$2)","v":-3.7130000000000027},{"$f":"SLOPE(I44:J44,$I$2:$J$2)","v":0.3589},{"$f":"INTERCEPT(I44:J44,$I$2:$J$2)","v":-4.0770000000000017},{"$f":"SLOPE(J44:K44,$J$2:$K$2)","v":0.38639999999999985},{"$f":"INTERCEPT(J44:K44,$J$2:$K$2)","v":-5.4519999999999911},{"$f":"SLOPE(K44:L44,$K$2:$L$2)","v":0.35809999999999997},{"$f":"INTERCEPT(K44:L44,$K$2:$L$2)","v":-3.7539999999999978},{"$f":"SLOPE(L44:M44,$L$2:$M$2)","v":0.38550000000000006},{"$f":"INTERCEPT(L44:M44,$L$2:$M$2)","v":-5.6720000000000077},{"$f":"IF($Z$1>=70,$Z$1*X44+Y44,IF(AND($Z$1>=60,$Z$1<70),V44*$Z$1+W44,IF(AND($Z$1>=50,$Z$1<60),T44*$Z$1+U44,IF(AND($Z$1>=40,$Z$1<50),R44*$Z$1+S44,IF(AND($Z$1>=30,$Z$1<40),P44*$Z$1+Q44,IF(AND($Z$1>0,$Z$1<30),N44*$Z$1+O44,0))))))","v":0},"SP",null,null,null,null,null,null,null,null,null,null,null,"SP"]
[20,"Standard","D","SP","VS-RH40A20","DVS-RH40A20",4.3159999999999998,8.6579999999999995,13.106,17.658999999999999,22.547999999999998,27.07,31.925000000000001,0.43419999999999992,-4.3679999999999986,0.44480000000000003,-4.6860000000000017,0.45529999999999987,-5.1059999999999945,0.48889999999999995,-6.7860000000000014,0.45220000000000021,-4.5840000000000174,0.48550000000000004,-6.9149999999999991,0,"SP",null,null,null,null,null,null,null,null,null,null,null,"SP"]
[25,"Standard","D","SP","VS-RH50A25","DVS-RH50A25",4.3079999999999998,8.6440000000000001,13.090999999999999,17.646999999999998,22.553000000000001,27.077999999999999,31.95,0.43359999999999999,-4.3639999999999999,0.44469999999999993,-4.6969999999999974,0.45559999999999989,-5.1329999999999956,0.49060000000000026,-6.8830000000000133,0.45249999999999985,-4.5969999999999906,0.48719999999999997,-7.0259999999999998,0,"SP",null,null,null,null,null,null,null,null,null,null,null,"SP"]
[32,"Standard","D","SP","VS-RH63A32","DVS-RH63A32",4.4489999999999998,8.9260000000000002,13.516,18.218,23.280999999999999,27.949000000000002,32.975999999999999,0.44770000000000004,-4.5050000000000008,0.45899999999999996,-4.8439999999999976,0.47019999999999995,-5.291999999999998,0.50629999999999986,-7.0969999999999942,0.46680000000000027,-4.7270000000000145,0.5026999999999997,-7.2399999999999807,0,"SP",null,null,null,null,null,null,null,null,null,null,null,"SP"]
[40,"Standard","D","SP","VS-RH75A40","DVS-RH75A40",4.7619999999999996,9.5500000000000007,14.457000000000001,19.478999999999999,24.884,29.864999999999998,35.225000000000001,0.47880000000000011,-4.8140000000000018,0.49070000000000003,-5.1710000000000012,0.50219999999999987,-5.6309999999999931,0.54050000000000009,-7.5460000000000065,0.49809999999999982,-5.0019999999999882,0.53600000000000025,-7.6550000000000153,0,"SP",null,null,null,null,null,null,null,null,null,null,null,"SP"]
[50,"Standard","D","SP","VS-RH125A50","DVS-RH125A50",3.8759999999999999,7.782,11.786,15.887,20.285,24.375,28.76,0.3906,-3.9360000000000008,0.40039999999999992,-4.2299999999999986,0.41010000000000008,-4.6180000000000021,0.43979999999999997,-6.1030000000000015,0.40899999999999997,-4.254999999999999,0.43850000000000017,-6.3200000000000074,0,"SP",null,null,null,null,null,null,null,null,null,null,null,"SP"]
[63,"Standard","D","SP","VS-RH125A63","DVS-RH125A63",5.008,10.042,15.195,20.463000000000001,26.113,31.34,36.945,0.50339999999999996,-5.0599999999999987,0.51529999999999998,-5.416999999999998,0.52680000000000005,-5.8770000000000024,0.56499999999999984,-7.7869999999999919,0.52270000000000005,-5.2490000000000023,0.5605,-7.8950000000000031,0,"SP",null,null,null,null,null,null,null,null,null,null,null,"SP"]
[75,"Standard","D","SP","VS-RH125A75","DVS-RH125A75",6.4260000000000002,12.866,19.442,26.151,33.345999999999997,39.959000000000003,47.052,0.64399999999999991,-6.4539999999999971,0.65760000000000007,-6.8620000000000019,0.67090000000000005,-7.3940000000000019,0.71949999999999958,-9.8239999999999768,0.66130000000000067,-6.3320000000000363,0.7092999999999996,-9.6919999999999717,0,"SP",null,null,null,null,null,null,null,null,null,null,null,"SP"]
[90,"Standard","D","SP","VS-RH160A90","DVS-RH160A90",5.7409999999999997,11.505000000000001,17.39,23.395,29.811,35.759,42.113,0.57640000000000013,-5.7870000000000026,0.58849999999999991,-6.149999999999995,0.60049999999999992,-6.629999999999999,0.64159999999999995,-8.6849999999999952,0.5948,-5.8770000000000024,0.63539999999999996,-8.7189999999999941,0,"SP",null,null,null,null,null,null,null,null,null,null,null,"SP"]
[110,"Standard","D","SP","VS-R200A110","DVS-R200A110",6.04,12.102,18.28,24.574000000000002,31.266999999999999,37.503,44.134,0.60620000000000007,-6.0840000000000014,0.61780000000000013,-6.4320000000000039,0.62940000000000007,-6.8960000000000043,0.66929999999999978,-8.8909999999999876,0.62360000000000004,-6.149000000000008,0.66310000000000002,-8.9140000000000015,0,"SP",null,null,null,null,null,null,null,null,null,null,null,"SP"]
[125,"Standard","D","SP","VS-R200A125","DVS-R200A125",7.1349999999999998,14.281000000000001,21.558,28.963999999999999,36.850999999999999,44.155999999999999,51.936999999999998,0.71460000000000012,-7.1570000000000018,0.72770000000000001,-7.5500000000000007,0.74059999999999993,-8.0659999999999989,0.78870000000000007,-10.471000000000004,0.73049999999999993,-6.9789999999999921,0.7780999999999999,-10.311,0,"SP",null,null,null,null,null,null,null,null,null,null,null,"SP"]
[140,"Standard","D","SP","FV-R225A140","DFV-R225A140",7.35,13.688000000000001,20.027000000000001,26.364999999999998,32.703000000000003,39.042000000000002,45.38,0.63380000000000014,-5.3260000000000041,0.63390000000000002,-5.3290000000000006,0.6337999999999997,-5.3249999999999886,0.63380000000000047,-5.3250000000000242,0.63389999999999991,-5.3309999999999889,0.63380000000000014,-5.3240000000000123,0,"SP",null,null,null,null,null,null,null,null,null,null,null,"SP"]
[160,"Standard","D","SP","FV-R250A160","DFV-R250A160",7.95,14.827,21.702999999999999,28.58,35.457000000000001,42.332999999999998,49.21,0.68769999999999998,-5.8039999999999985,0.68759999999999988,-5.8009999999999948,0.68769999999999987,-5.8049999999999926,0.6877000000000002,-5.8050000000000068,0.68759999999999977,-5.7989999999999924,0.6877000000000002,-5.8060000000000116,0,"SP",null,null,null,null,null,null,null,null,null,null,null,"SP"]
[225,"Standard","D","SP","FV-R315A225","DFV-R315A225",9.1120000000000001,17.707000000000001,26.300999999999998,34.896000000000001,43.491,52.085000000000001,60.68,0.85950000000000004,-8.0779999999999994,0.85939999999999972,-8.0749999999999922,0.85950000000000015,-8.0790000000000077,0.85949999999999993,-8.0789999999999935,0.85940000000000016,-8.0730000000000146,0.85949999999999993,-8.0799999999999912,0,"SP",null,null,null,null,null,null,null,null,null,null,null,"SP"]
[16,"DHC","D","SP","VS-RH75A16","DVS-RH75A16",2.1419999999999999,4.3099999999999996,6.5419999999999998,8.8369999999999997,11.195,13.616,16.099,0.21679999999999996,-2.1939999999999991,0.22320000000000001,-2.3860000000000001,0.22949999999999998,-2.637999999999999,0.23580000000000007,-2.953000000000003,0.24209999999999993,-3.330999999999996,0.24830000000000005,-3.7650000000000023,0,"SP",null,null,null,null,null,null,null,null,null,null,null,"SP"]
[20,"DHC","D","SP","VS-RH90A20","DVS-RH90A20",2.278,4.5819999999999999,6.9530000000000003,9.3879999999999999,11.888999999999999,14.454000000000001,17.084,0.23039999999999999,-2.33,0.23710000000000003,-2.5310000000000006,0.24349999999999994,-2.7869999999999973,0.25009999999999993,-3.1169999999999956,0.25650000000000012,-3.5010000000000066,0.2629999999999999,-3.9559999999999942,0,"SP",null,null,null,null,null,null,null,null,null,null,null,"SP"]
[25,"DHC","D","SP","VS-RH90A25","DVS-RH90A25",2.6720000000000002,5.3730000000000002,8.15,11.002000000000001,13.93,16.933,20.009,0.27010000000000001,-2.7300000000000004,0.27770000000000006,-2.958000000000002,0.28520000000000001,-3.2579999999999991,0.29279999999999989,-3.6379999999999946,0.30030000000000001,-4.088000000000001,0.30760000000000004,-4.5990000000000038,0,"SP",null,null,null,null,null,null,null,null,null,null,null,"SP"]
[32,"DHC","D","SP","VS-RH125A32","DVS-RH125A32",2.7109999999999999,5.45,8.2620000000000005,11.147,14.105,17.134,20.234000000000002,0.27390000000000003,-2.7670000000000012,0.28120000000000006,-2.9860000000000024,0.28849999999999998,-3.2779999999999987,0.29580000000000001,-3.6430000000000007,0.3029,-4.0690000000000008,0.31000000000000016,-4.5660000000000096,0,"SP",null,null,null,null,null,null,null,null,null,null,null,"SP"]
[40,"DHC","D","SP","VS-RH125A40","DVS-RH125A40",3.19,6.41,9.7129999999999992,13.1,16.568999999999999,20.12,23.751999999999999,0.32200000000000001,-3.2500000000000009,0.33029999999999987,-3.498999999999997,0.33870000000000006,-3.8350000000000026,0.34689999999999999,-4.245000000000001,0.35510000000000019,-4.7370000000000125,0.3631999999999998,-5.3039999999999843,0,"SP",null,null,null,null,null,null,null,null,null,null,null,"SP"]
[50,"DHC","D","SP","VS-RH160A50","DVS-RH160A50",3.286,6.5990000000000002,9.9909999999999997,13.461,17.007999999999999,20.632000000000001,24.331,0.33130000000000004,-3.3400000000000007,0.33919999999999995,-3.5769999999999982,0.34700000000000003,-3.8890000000000029,0.35469999999999985,-4.2739999999999903,0.36240000000000022,-4.7360000000000149,0.36989999999999978,-5.260999999999985,0,"SP",null,null,null,null,null,null,null,null,null,null,null,"SP"]
[63,"DHC","D","SP","VS-RH160A63",{"$f":"C64&E64","v":"DVS-RH160A63"},3.9460000000000002,7.9210000000000003,11.987,16.143000000000001,20.39,24.725000000000001,29.149000000000001,0.39750000000000002,-4.0039999999999996,0.40659999999999996,-4.2769999999999975,0.41560000000000002,-4.6370000000000005,0.42469999999999997,-5.0919999999999987,0.43350000000000011,-5.6200000000000045,0.44239999999999996,-6.2429999999999986,0,"SP",null,null,null,null,null,null,null,null,null,null,null,{"$f":"D64","v":"SP"}]
[75,"DHC","D","SP","VS-RH160A75","DVS-RH160A75",4.641,9.3089999999999993,14.082000000000001,18.957999999999998,23.934999999999999,29.013000000000002,34.191000000000003,0.46679999999999994,-4.6949999999999985,0.47730000000000017,-5.0100000000000051,0.48759999999999976,-5.4219999999999899,0.49770000000000003,-5.9269999999999996,0.50780000000000025,-6.533000000000019,0.51780000000000004,-7.232999999999997,0,"SP",null,null,null,null,null,null,null,null,null,null,null,{"$f":"D68","v":"SP"}]
[125,"DHC","D","SP","F-SL200A125",{"$f":"C66&E66","v":"DF-SL200A125"},7.1349999999999998,14.281000000000001,21.558,28.963999999999999,36.850999999999999,44.155999999999999,51.936999999999998,0.71460000000000012,-7.1570000000000018,0.72770000000000001,-7.5500000000000007,0.74059999999999993,-8.0659999999999989,0.78870000000000007,-10.471000000000004,0.73049999999999993,-6.9789999999999921,0.7780999999999999,-10.311,0,"SP",null,null,null,null,null,null,null,null,null,null,null,{"$f":"D69","v":"SP"}]
[32,"+31","D","SP","VS-RH90A32","DVS-RH90A32",3.2480000000000002,6.5270000000000001,9.8949999999999996,13.352,16.896000000000001,20.527000000000001,24.244,0.32789999999999997,-3.3099999999999996,0.33679999999999993,-3.5769999999999982,0.34570000000000006,-3.9330000000000034,0.35440000000000005,-4.3680000000000039,0.36310000000000003,-4.8900000000000006,0.37169999999999986,-5.4919999999999902,0,"SP",null,null,null,null,null,null,null,null,null,null,null,"SP"]
[40,"+31","D","SP","VS-RH90A40","DVS-RH90A40",4.032,8.0939999999999994,12.260999999999999,16.530999999999999,20.904,25.378,29.952000000000002,0.40619999999999989,-4.0919999999999979,0.41670000000000001,-4.4070000000000018,0.42699999999999994,-4.8189999999999973,0.43730000000000013,-5.3340000000000067,0.44740000000000002,-5.9400000000000048,0.45740000000000014,-6.6400000000000148,0,"SP",null,null,null,null,null,null,null,null,null,null,null,"SP"]
[16,null,"D","SP","VS-RS40A16","DVS-RS40A16",3.3759999999999999,6.7809999999999997,10.279,13.868,17.731999999999999,21.312999999999999,25.167999999999999,0.34049999999999997,-3.4339999999999993,0.34980000000000006,-3.7130000000000027,0.3589,-4.0770000000000017,0.38639999999999985,-5.4519999999999911,0.35809999999999997,-3.7539999999999978,0.38550000000000006,-5.6720000000000077,0,{"$f":"D69","v":"SP"},null,null,null,null,null,null,null,null,null,null,null,"SP"]
[20,null,"D","SP","VS-RS40A20","DVS-RS40A20",4.3159999999999998,8.6579999999999995,13.106,17.658999999999999,22.547999999999998,27.07,31.925000000000001,0.43419999999999992,-4.3679999999999986,0.44480000000000003,-4.6860000000000017,0.45529999999999987,-5.1059999999999945,0.48889999999999995,-6.7860000000000014,0.45220000000000021,-4.5840000000000174,0.48550000000000004,-6.9149999999999991,0,"SP",null,null,null,null,null,null,null,null,null,null,null,"SP"]
[25,null,"D","SP","VS-RS50A25","DVS-RS50A25",4.3079999999999998,8.6440000000000001,13.090999999999999,17.646999999999998,22.553000000000001,27.077999999999999,31.95,0.43359999999999999,-4.3639999999999999,0.44469999999999993,-4.6969999999999974,0.45559999999999989,-5.1329999999999956,0.49060000000000026,-6.8830000000000133,0.45249999999999985,-4.5969999999999906,0.48719999999999997,-7.0259999999999998,0,"SP",null,null,null,null,null,null,null,null,null,null,null,"SP"]
[32,null,"D","SP","VS-RS63A32","DVS-RS63A32",4.4489999999999998,8.9260000000000002,13.516,18.218,23.280999999999999,27.949000000000002,32.975999999999999,0.44770000000000004,-4.5050000000000008,0.45899999999999996,-4.8439999999999976,0.47019999999999995,-5.291999999999998,0.50629999999999986,-7.0969999999999942,0.46680000000000027,-4.7270000000000145,0.5026999999999997,-7.2399999999999807,0,"SP",null,null,null,null,null,null,null,null,null,null,null,"SP"]
[40,null,"D","SP","VS-RS75A40","DVS-RS75A40",4.7619999999999996,9.5500000000000007,14.457000000000001,19.478999999999999,24.884,29.864999999999998,35.225000000000001,0.47880000000000011,-4.8140000000000018,0.49070000000000003,-5.1710000000000012,0.50219999999999987,-5.6309999999999931,0.54050000000000009,-7.5460000000000065,0.49809999999999982,-5.0019999999999882,0.53600000000000025,-7.6550000000000153,0,"SP",null,null,null,null,null,null,null,null,null,null,null,"SP"]
[50,null,"D","SP","VS-RS90A50",{"$f":"C74&E74","v":"DVS-RS90A50"},5.327,10.677,16.152000000000001,21.751000000000001,27.77,33.308999999999997,39.265000000000001,0.53500000000000003,-5.3730000000000011,0.5475000000000001,-5.7480000000000047,0.55990000000000006,-6.2439999999999998,0.60189999999999988,-8.3439999999999941,0.55389999999999984,-5.4639999999999915,0.59560000000000035,-8.383000000000024,0,"SP",null,null,null,null,null,null,null,null,null,null,null,"SP"]
[63,null,"D","SP","VS-RS125A63","DVS-RS125A63",5.008,10.042,15.195,20.463000000000001,26.113,31.34,36.945,0.50339999999999996,-5.0599999999999987,0.51529999999999998,-5.416999999999998,0.52680000000000005,-5.8770000000000024,0.56499999999999984,-7.7869999999999919,0.52270000000000005,-5.2490000000000023,0.5605,-7.8950000000000031,0,"SP",null,null,null,null,null,null,null,null,null,null,null,{"$f":"D75","v":"SP"}]
[75,null,"D","SP","VS-RS125A75","DVS-RS125A75",6.4260000000000002,12.866,19.442,26.151,33.345999999999997,39.959000000000003,47.052,0.64399999999999991,-6.4539999999999971,0.65760000000000007,-6.8620000000000019,0.67090000000000005,-7.3940000000000019,0.71949999999999958,-9.8239999999999768,0.66130000000000067,-6.3320000000000363,0.7092999999999996,-9.6919999999999717,0,"SP",null,null,null,null,null,null,null,null,null,null,null,"SP"]
[90,null,"D","SP","VS-RS160A90","DVS-RS160A90",5.7409999999999997,11.505000000000001,17.39,23.395,29.811,35.759,42.113,0.57640000000000013,-5.7870000000000026,0.58849999999999991,-6.149999999999995,0.60049999999999992,-6.629999999999999,0.64159999999999995,-8.6849999999999952,0.5948,-5.8770000000000024,0.63539999999999996,-8.7189999999999941,0,"SP",null,null,null,null,null,null,null,null,null,null,null,"SP"]
[16,"Standard","D","D","VS-RH63A2/16","DVS-RH63A2/16",3.5270000000000001,5.8780000000000001,8.23,10.581,12.932,15.284000000000001,17.635000000000002,0.23509999999999998,-1.1749999999999989,0.23520000000000002,-1.1780000000000008,0.23509999999999992,-1.1739999999999959,0.23510000000000009,-1.1740000000000066,0.23520000000000002,-1.1800000000000015,0.23510000000000009,-1.1730000000000054,0,"D",null,null,null,null,null,null,null,null,null,null,null,"D"]
[20,"Standard","D","D","VS-RH75A2/20","DVS-RH75A2/20",3.6080000000000001,6.0129999999999999,8.4179999999999993,10.824,13.228999999999999,15.634,18.039000000000001,0.24049999999999996,-1.2019999999999991,0.24049999999999994,-1.2019999999999973,0.24060000000000006,-1.2060000000000048,0.24049999999999994,-1.200999999999997,0.2405000000000001,-1.2010000000000076,0.2405000000000001,-1.2010000000000076,0,"D",null,null,null,null,null,null,null,null,null,null,null,"D"]
[25,"Standard","D","D","VS-RH125A2/25","DVS-RH125A2/25",2.992,4.9870000000000001,6.9809999999999999,8.9760000000000009,10.971,12.965,14.96,0.19950000000000004,-0.99800000000000066,0.19939999999999997,-0.99499999999999922,0.19950000000000009,-0.99900000000000411,0.19949999999999993,-0.99899999999999523,0.19939999999999997,-0.99299999999999855,0.19950000000000009,-1.0000000000000071,0,"D",null,null,null,null,null,null,null,null,null,null,null,"D"]
[32,"Standard","D","D","VS-RH125A2/32","DVS-RH125A2/32",3.8260000000000001,6.3769999999999998,8.9280000000000008,11.478,14.029,16.579999999999998,19.131,0.25509999999999999,-1.2759999999999998,0.2551000000000001,-1.2760000000000034,0.25499999999999989,-1.2719999999999949,0.25509999999999999,-1.277000000000001,0.25509999999999983,-1.2769999999999886,0.25510000000000022,-1.2770000000000152,0,"D",null,null,null,null,null,null,null,null,null,null,null,"D"]
[40,"Standard","D","D","VS-RH160A2/40","DVS-RH160A2/40",3.3559999999999999,5.68,8.0039999999999996,10.327999999999999,12.651999999999999,14.976000000000001,17.3,0.2324,-1.2919999999999998,0.2324,-1.2920000000000007,0.2324,-1.2919999999999998,0.2324,-1.2920000000000016,0.23240000000000016,-1.2920000000000105,0.2324,-1.291999999999998,0,"D",null,null,null,null,null,null,null,null,null,null,null,"D"]
[50,"Standard","D","D","VS-RH160A2/50","DVS-RH160A2/50",4.3739999999999997,7.476,10.579000000000001,13.682,16.785,19.887,22.99,0.31020000000000003,-1.830000000000001,0.31030000000000008,-1.833000000000002,0.31029999999999996,-1.8329999999999966,0.31029999999999996,-1.8329999999999984,0.31020000000000003,-1.8270000000000053,0.3102999999999998,-1.833999999999989,0,"D",null,null,null,null,null,null,null,null,null,null,null,"D"]
[63,"Standard","D","D","VS-RH200A2/63","DVS-RH200A2/63",4.3739999999999997,7.8,11.226000000000001,14.651999999999999,18.077999999999999,21.504000000000001,24.93,0.34260000000000007,-2.4780000000000015,0.34260000000000013,-2.4780000000000051,0.34259999999999985,-2.4779999999999927,0.34260000000000007,-2.4780000000000051,0.34260000000000018,-2.4780000000000122,0.34259999999999985,-2.4779999999999909,0,"D",null,null,null,null,null,null,null,null,null,null,null,"D"]
[16,"DHC","D","D","VS-RH90A2/16","DVS-RH90A2/16",3.2530000000000001,5.4210000000000003,7.59,9.7579999999999991,11.926,14.095000000000001,16.263000000000002,0.21679999999999999,-1.0830000000000002,0.21689999999999998,-1.0859999999999994,0.21679999999999994,-1.0819999999999972,0.2168000000000001,-1.0820000000000078,0.21690000000000004,-1.0880000000000027,0.2168000000000001,-1.0810000000000066,0,"D",null,null,null,null,null,null,null,null,null,null,null,"D"]
[20,"DHC","D","D","VS-RH125A2/20","DVS-RH125A2/20",2.4969999999999999,4.1619999999999999,5.827,7.492,9.157,10.821999999999999,12.487,0.16649999999999998,-0.83299999999999974,0.16649999999999998,-0.8329999999999993,0.16649999999999998,-0.8329999999999993,0.16649999999999998,-0.83299999999999841,0.16649999999999993,-0.83299999999999486,0.16650000000000009,-0.83300000000000907,0,"D",null,null,null,null,null,null,null,null,null,null,null,"D"]
[32,"DHC","D","D","VS-RH160A2/32","DVS-RH160A2/32",2.7429999999999999,4.6360000000000001,6.5289999999999999,8.4209999999999994,10.314,12.207000000000001,14.1,0.18930000000000002,-1.043000000000001,0.1893,-1.0430000000000001,0.18919999999999995,-1.0389999999999979,0.18930000000000008,-1.044000000000004,0.18930000000000008,-1.044000000000004,0.18929999999999989,-1.0439999999999898,0,"D",null,null,null,null,null,null,null,null,null,null,null,"D"]
[16,null,"D","D","VS-RS63A2/16","DVS-RS63A2/16",3.5270000000000001,5.8780000000000001,8.23,10.581,12.932,15.284000000000001,17.635000000000002,0.23509999999999998,-1.1749999999999989,0.23520000000000002,-1.1780000000000008,0.23509999999999992,-1.1739999999999959,0.23510000000000009,-1.1740000000000066,0.23520000000000002,-1.1800000000000015,0.23510000000000009,-1.1730000000000054,0,"D",null,null,null,null,null,null,null,null,null,null,null,"D"]
[20,null,"D","D","VS-RS75A2/20","DVS-RS75A2/20",3.6080000000000001,6.0129999999999999,8.4179999999999993,10.824,13.228999999999999,15.634,18.039000000000001,0.24049999999999996,-1.2019999999999991,0.24049999999999994,-1.2019999999999973,0.24060000000000006,-1.2060000000000048,0.24049999999999994,-1.200999999999997,0.2405000000000001,-1.2010000000000076,0.2405000000000001,-1.2010000000000076,0,"D",null,null,null,null,null,null,null,null,null,null,null,"D"]
[25,null,"D","D","VS-RS125A2/25","DVS-RS125A2/25",2.992,4.9870000000000001,6.9809999999999999,8.9760000000000009,10.971,12.965,14.96,0.19950000000000004,-0.99800000000000066,0.19939999999999997,-0.99499999999999922,0.19950000000000009,-0.99900000000000411,0.19949999999999993,-0.99899999999999523,0.19939999999999997,-0.99299999999999855,0.19950000000000009,-1.0000000000000071,0,"D",null,null,null,null,null,null,null,null,null,null,null,"D"]
[32,null,"D","D","VS-RS125A2/32","DVS-RS125A2/32",3.8260000000000001,6.3769999999999998,8.9280000000000008,11.478,14.029,16.579999999999998,19.131,0.25509999999999999,-1.2759999999999998,0.2551000000000001,-1.2760000000000034,0.25499999999999989,-1.2719999999999949,0.25509999999999999,-1.277000000000001,0.25509999999999983,-1.2769999999999886,0.25510000000000022,-1.2770000000000152,0,"D",null,null,null,null,null,null,null,null,null,null,null,"D"]
[40,null,"D","D","VS-RS160A2/40","DVS-RS160A2/40",3.3559999999999999,5.68,8.0039999999999996,10.327999999999999,12.651999999999999,14.976000000000001,17.3,0.2324,-1.2919999999999998,0.2324,-1.2920000000000007,0.2324,-1.2919999999999998,0.2324,-1.2920000000000016,0.23240000000000016,-1.2920000000000105,0.2324,-1.291999999999998,0,"D",null,null,null,null,null,null,null,null,null,null,null,"D"]
[50,null,"D","D","VS-RS160A2/50","DVS-RS160A2/50",4.3739999999999997,7.476,10.579000000000001,13.682,16.785,19.887,22.99,0.31020000000000003,-1.830000000000001,0.31030000000000008,-1.833000000000002,0.31029999999999996,-1.8329999999999966,0.31029999999999996,-1.8329999999999984,0.31020000000000003,-1.8270000000000053,0.3102999999999998,-1.833999999999989,0,"D",null,null,null,null,null,null,null,null,null,null,null,"D"]
[63,null,"D","D","VS-RS200A2/63","DVS-RS200A2/63",4.3739999999999997,7.8,11.226000000000001,14.651999999999999,18.077999999999999,21.504000000000001,24.93,0.34260000000000007,-2.4780000000000015,0.34260000000000013,-2.4780000000000051,0.34259999999999985,-2.4779999999999927,0.34260000000000007,-2.4780000000000051,0.34260000000000018,-2.4780000000000122,0.34259999999999985,-2.4779999999999909,0,"D",null,null,null,null,null,null,null,null,null,null,null,"D"]

{"sheet":"PRINTOUT","index":5,"n_rows":32,"n_cols":11,"rows_kept":32,"cut":false,"hidden":false,"merged":[]}
[]
[null,{"$f":"CALC!B3","v":"PIPE SIZING FOR SINGLE OR DOUBLE LINES BETWEEN 2 NET POSITIONS"}]
[null,{"$f":"CALC!B4","v":"FLEXALEN - PREINSULATED PIPE SYSTEMS"}]
[null,{"$f":"CALC!B5","v":"MADE FOR DOMESTIC WATER DISTRIBUTION, COOLING AND HEATING SUPPLY LINES"}]
[]
[]
[null,null,null,null,null,null,null,null,{"$f":"CALC!B24","v":"OD (DIMENSION)"},null,{"$f":"CALC!D24","v":16}]
[null,null,null,null,null,null,null,null,{"$f":"CALC!B25","v":"VELOCITY"},null,{"$f":"CALC!D25","v":0}]
[null,"FLEXALEN",null,{"$f":"CALC!H30","v":"HEATING / COOLING (F / R)"},null,null,null,null,{"$f":"CALC!B21","v":"VOLUMETRIC FLOW RATE"},null,{"$f":"CALC!D21","v":0}]
[null,null,null,null,null,null,null,null,{"$f":"CALC!B20","v":"HEAT LOAD kW SOURCE"},null,{"$f":"CALC!D20","v":0}]
[null,null,null,null,null,null,null,null,{"$f":"CALC!B13","v":"TEMP. DIFFERENCE (Tf - Tr)"},null,{"$f":"CALC!D13","v":0}]
[null,null,null,null,null,null,null,null,{"$f":"CALC!G8","v":"USABLE TEMP. DIFF."},null,{"$f":"CALC!I8","v":"Choose product"}]
[null,{"$f":"CALC!G12","v":"SOURCE"},{"$f":"CALC!H12","v":0},{"$f":"CALC!I12","v":"RESERVE PRESSURE FOR PUMP"},null,null,null,null,{"$f":"CALC!G9","v":"USABLE LOAD"},null,{"$f":"CALC!I9","v":"Choose product"}]
[null,"DELTA T",null,{"$f":"CALC!I13","v":"Temperature °C"},{"$f":"CALC!J13","v":"Pressure loss bar"},{"$f":"CALC!K13","v":"Dimension OD"},{"$f":"CALC!L13","v":"END POINT"},null,{"$f":"CALC!B26","v":"PRESSURE DROP FLOW"},null,{"$f":"CALC!D26","v":0}]
[null,{"$f":"CALC!G14","v":0},null,null,null,null,null,null,{"$f":"CALC!B27","v":"PRESSURE DROP RETURN"},null,{"$f":"CALC!D27","v":0}]
[null,null,{"$f":"CALC!H15","v":"FLOW"},{"$f":"CALC!I15","v":0},{"$f":"CALC!J15","v":0},{"$f":"CALC!K15","v":16},null,null,{"$f":"CALC!B28","v":"PRESSURE DROP TOTAL"},null,{"$f":"CALC!D28","v":0}]
[null,{"$f":"CALC!G16","v":"PUMP"},{"$f":"CALC!H16","v":0},null,null,{"$f":"CALC!K16","v":"Choose product"}]
[null,{"$f":"CALC!G17","v":0},{"$f":"CALC!H17","v":"RETURN"},{"$f":"CALC!I17","v":0},{"$f":"CALC!J17","v":0},{"$f":"CALC!K17","v":16},null,null,{"$f":"CALC!G25","v":"Pressure rating"},{"$f":"CALC!I25","v":"at 95°C"},{"$f":"CALC!H25","v":8}]
[null,{"$f":"CALC!G18","v":0},{"$f":"CALC!H18","v":0},null,null,{"$f":"CALC!K18","v":"Choose product"},null,null,{"$f":"CALC!G26","v":"max. Pressure"},{"$f":"CALC!I26","v":"at Service Temperature"},{"$f":"CALC!H26","v":16.388449863675987}]
[null,null,null,{"$f":"CALC!I19","v":0},null,null,null,null,{"$f":"CALC!G27","v":"Pressure drop"},{"$f":"CALC!I27","v":"FLEXALEN pipes only"},{"$f":"CALC!H27","v":0}]
[null,null,null,null,null,null,null,null,{"$f":"CALC!G28","v":"Reserve press."},{"$f":"CALC!I28","v":"at Service Temperature"},{"$f":"CALC!H28","v":16.388449863675987}]
[]
[null,null,null,null,null,null,null,null,{"$f":"CALC!G21","v":"Soil temperature"},null,{"$f":"CALC!H21","v":10}]
[null,null,null,null,null,null,null,null,{"$f":"CALC!G22","v":"Coverage"},null,{"$f":"CALC!H22","v":800}]
[null,null,null,null,null,null,null,null,{"$f":"CALC!G23","v":"Lambda soil"},null,{"$f":"CALC!H23","v":1}]
[null,null,null,null,null,null,null,null,{"$f":"CALC!J21","v":"Temperature drop Flow"},null,{"$f":"CALC!L21","v":"Choose product"}]
[null,null,null,null,null,null,null,null,{"$f":"CALC!J22","v":"Trench Length"},null,{"$f":"CALC!L22","v":0}]
[null,null,null,null,null,null,null,null,{"$f":"CALC!J23","v":"Dwell time Flow"},null,{"$f":"CALC!L23","v":0}]
[null,null,null,null,null,null,null,null,{"$f":"CALC!G10","v":"NET VOLUME"},null,{"$f":"CALC!I10","v":0}]
[]
[null,null,null,null,null,null,null,null,{"$f":"HLOOKUP(CALC!$K$32,Language!$A:$Y,80,0)","v":"FLEXALEN Product"},null,{"$f":"TEMPERATUR!C5","v":0}]
[null,null,null,null,null,null,null,null,{"$f":"HLOOKUP(CALC!$K$32,Language!$A:$Y,81,0)","v":"Quantity"},null,{"$f":"IF(OR(CALC!$G$29=\"e\",AND(CALC!$G$29=\"d\",VLOOKUP(K31,PARAMETER_HL!E4:AA94,23,0)=\"d\")),CALC!D14,2*CALC!D14)","v":{"$error":"#N/A"}}]

{"sheet":"TEMPERATUR","index":6,"n_rows":28,"n_cols":8,"rows_kept":28,"cut":false,"hidden":true,"merged":[]}
[]
["CALCULATION TEMPERATURE DROP:"]
[]
[null,"Supply line / Heating, Cooling",{"$f":"CALC!G29","v":"D"},"(E or D)"]
[null,"Product choosen",{"$f":"VLOOKUP(CALC!D30,PARAMETER_HL!AB6:AC12,2,FALSE)","v":0}]
[]
[null,null,"PIPE","PIPE"]
[null,null,"FLOW","RETURN"]
["O.D. ","Diameter pipe",{"$f":"CALC!$K$15","v":16},{"$f":"CALC!$K$17","v":16},"mm"]
["ϑ","Temperature medium",{"$f":"CALC!$D$11","v":0},{"$f":"CALC!$D$12","v":0},"°C",{"$f":"C10+D10","v":0}]
["mm","mass (medium) / m",{"$f":"((LOOKUP(C9,PARAMETER_R!$A$7:$A$20,PARAMETER_R!$B$7:$B$20)/2)^2*PI()*0.001)","v":0.10568317686676065},{"$f":"((LOOKUP(D9,PARAMETER_R!$A$7:$A$20,PARAMETER_R!$B$7:$B$20)/2)^2*PI()*0.001)","v":0.10568317686676065},"kg","water: 1l = 1kg "]
["mtot","mass total ",{"$f":"C11*PARAMETER_R!C28","v":0},{"$f":"D11*PARAMETER_R!C28","v":0},"kg","Total volume:",{"$f":"IF(ISERROR(D12),C12,C12+D12)","v":0},"l"]
["t","dwell time",{"$f":"PARAMETER_R!C28/CALC!$D$25","v":{"$error":"#DIV/0!"}},{"$f":"PARAMETER_R!C28/CALC!$D$25","v":{"$error":"#DIV/0!"}},"s"]
["Pm","Power loss (Heat loss) / m",{"$f":"IF(C4=\"E\",VLOOKUP($C$4&$C$5,PARAMETER_HL!$F$3:$Z$94,21,0),VLOOKUP($C$4&$C$5,PARAMETER_HL!$F$3:$Z$94,21,0)*(1/(F10/C10)))","v":{"$error":"#N/A"}},{"$f":"IF(C4=\"E\",\"0\",VLOOKUP($C$4&$C$5,PARAMETER_HL!$F$3:$Z$94,21,0)*(1/(F10/D10)))","v":{"$error":"#N/A"}},"W"]
["Ptot","Heat loss total",{"$f":"C14*PARAMETER_R!C28","v":{"$error":"#N/A"}},{"$f":"D14*PARAMETER_R!C28","v":{"$error":"#N/A"}},"W"]
[]
["c","specific heat capacity (water)",4190,4190,"J / kg.K"]
[]
["E1","Engergy content",{"$f":"C11*C17*C10","v":0},{"$f":"D11*D17*D10","v":0},"J"]
["E2 ","Engergy loss due heat loss",{"$f":"C14*C13","v":{"$error":"#N/A"}},{"$f":"D14*D13","v":{"$error":"#N/A"}},"J"]
[]
["ϑ","Temperature medium",{"$f":"(C19-C20)/(C11*C17)","v":{"$error":"#N/A"}},{"$f":"(D19-D20)/(D11*D17)","v":{"$error":"#N/A"}},"°C"]
["ΔT","Temperature drop",{"$f":"C10-C22","v":{"$error":"#N/A"}},{"$f":"D10-D22","v":{"$error":"#N/A"}},"K"]
[]
[]
["Temperature difference:",null,{"$f":"CALC!$I$8","v":"Choose product"},"K"]
["Volumetric flow:",null,{"$f":"CALC!$D$21","v":0},"l/s"]
["Usable load",null,{"$f":"(C26*C27*C17)/1000","v":{"$error":"#VALUE!"}},"kW"]

{"sheet":"Language","index":7,"n_rows":101,"n_cols":15,"rows_kept":101,"cut":false,"hidden":true,"merged":[]}
["INDEX","ENGLISH","GERMAN","BULAGRIAN","DUTCH ","FRENCH","ROMANIAN","TURKISH","RUSSIAN","Czech","ITALIAN","HUNGARIAN","CROATIAN","POLISH","ESPAÑOL"]
[1,"PIPE SIZING FOR SINGLE OR DOUBLE LINES BETWEEN 2 NET POSITIONS","ROHRLEITUNGSBERECHNUNG  - VERBINDUNG VON ZWEI NETZPUNKTEN MIT EINZEL- ODER DOPPELLEITUNG","ОРАЗМЕРЯВАНЕ НА ТРЪБОПРОВОД - СЪЕДИНЯВАНЕ НА 2 ТОЧКИ ЧРЕЗ ЕДНО- ИЛИ ДВУТРЪБНА СИСТЕМА","BUISAFMETING VOOR ENKEL OF DUBBEL LEIDINGSYSTEEM VAN A NAAR B","DIMENSIONNEMENT TUBE FLEXALEN LIGNE SIMPLE OU DOUBLE POUR LIAISON ENTRE BATIMENTS ","DIMENSIONARE CONDUCTE CIRCUITE SIMPLE SAU DUBLE INTRE DOUA PUNCTE DIN RETEA","İKİ NOKTA ARASINDAKİ TEKLİ VEYA İKİLİ HATLAR İÇİN BORU EBADI","РАСЧЕТ ДИАМЕТРА ТРУБ ДЛЯ ОДНОТРУБНОЙ ИЛИ ДВУХТРУБНОЙ СИСТЕМ МЕЖДУ ДВУМЯ ТОЧКАМИ","VÝPOČET POTRUBÍ PRO TRUBNÍ VEDENÍ - SPOJENÍ DVOU BODŮJEDNOTRUBNÍM NEBO DVOUTRUBNÍM VEDENÍM","Dimensionamento Tubo per linee singole o doppie tra due punti distinti","Cső méretezése - két pontot összekötő egy/duplavezetékes csőrendszer","DIMENZIONIRANJE CJEVOVODA - SPOJ 2 TOČKE SUSTAVA ( A-B ) - ZA JEDNOCJEVNE ILI DVOCJEVNE SUSTAVE","Program doboru średnic dla rur pojedyńczych i podwójnych FLEXALEN pomiędzy źródłem ciepła i odbiorcą","DIMENSIONAMIENTO DE TUBERIA CON LINEA DOBLE O LINEA SENCILLA PARA CONEXION ENTRE DOS PUNTOS"]
[2,"FLEXALEN - PREINSULATED PIPE SYSTEMS","FLEXALEN - ISOLIERTE ROHRSYSTEME","FLEXALEN - СИСТЕМА ОТ ПРЕДВАРИТЕЛНО ИЗОЛИРАНИ ТРЪБИ","FLEXALEN VOORGEISOLEERD LEIDINGSYSTEEM","FLEXALEN - SYSTEME TUBES PRE-ISOLES","FLEXALEN-SISTEM CONDUCTE PREIZOLATE","FLEXALEN - ÖNYALITIMLI BORU SİSTEMLERİ","FLEXALEN - ПРЕДВАРИТЕЛЬНО ИЗОЛИРОВАННЫЕ ТРУБЫ","FLEXALEN - PŘEDIZOLOVANÉ POTRUBNÍ SYSTÉMY","Flexalen 600 - Sistema di tubi preisolati","Flexalen - előszigetelt csőrendszer","FLEXALEN 600 - PREDIZOLIRANI CIJEVNI SUSTAV","Flexalen - system preizolowanych rur","FLEXALEN - SISTEMA DE TUBERIA PRE AISLADO"]
[3,"MADE FOR DOMESTIC WATER DISTRIBUTION, COOLING AND HEATING SUPPLY LINES","BERECHNUNG GILT FÜR BRAUCHWASSER-, HEIZUNG- UND KÜHLLEITUNGEN","ИЗЧИСЛЕНИЕТО Е ВАЛИДНО ЗА ПИТЕЙНА ВОДА И ЗА ВОДА ПРИГОДНА ЗА ОТОПЛИТЕЛНИ СИСТЕМИ","GESCHIKT VOOR TAPWATER EN WARMTE/KOUDE DISTRIBUTIE","CE PROGRAMME EST DEFINI POUR LE CALCUL DES RESEAUX DE CHAUFFAGE ET DE DISTRIBUTION D'EAU SANITAIRE","FABRICATE PENTRU RETELE DE DISTRIBUTIE A ENERGIEI TERMICE SI APEI MENAJERE ","SICAK-SOĞUK SU TESİSATLARI VE BÖLGESEL  ISITMA  HATLARI İÇİN YAPILMIŞTIR","ЭТОТ РАСЧЕТ СДЕЛАН ДЛЯ СИСТЕМ БЫТОВОГО ВОДОСНАБЖЕНИЯ И ЦЕНТРАЛЬНОГО ОТОПЛЕНИЯ","VYVINUTO PRO ROZVODY VODY A SYSTÉMY DÁLKOVÉHO TOPENÍ ","Prodotto per distribuire acqua sanitaria e reti di teleriscaldamento","Számítások használati és Fűtővís rendszerek esetében érvényesek","IZRAČUN VRIJEDI ZA SANITARNU I NORMALNO KONDICIONIRANU VODU U TOPLOVODNIM SUSTAVIMA GRIJANJA","Przeznaczony do dystrybucji ciepłej wody użytkowej i uzdatnionej wody grzewczej","DISEÑADO PARA APLICACIONES DE DISTRIBUCION DOMESTICA DE AGUA, AGUA HELADA Y CALEFACCION"]
[4,"QUALITY FACTOR","QUALITÄTSFAKTOR","КАЧЕСТВЕН  ФАКТОР","KWALITEITS FACTOR","FACT QUALITE","FACTOR CALITATE","KALİTE FAKTÖRÜ","КАЧЕСТВЕННЫЙ ФАКТОР","FAKTOR JAKOSTI","Fattore Qualità","Minőségi tényező","KVALITATIVNI FAKTOR","Współczynnik jakości","FACTOR CALIDAD"]
[5,"TEMPERATUR FACTOR","TEMPERATURFAKTOR","ТЕМПЕРАТУРЕН  ФАКТОР","TEMPERATUUR FACTOR","FACT TEMPERATURE","FACTOR TEMPERATURA","SICAKLIK FAKTÖRÜ","ТЕМПЕРАТУРНЫЙ ФАКТОР","FAKTOR TEPLOTY","Fattore Temp.","Hőmérsékleti tényező","TEMPERATURNI FAKTOR","Współczynnik temperatury","FACTOR TEMPERATURA"]
[6,"SIZE TUNING","ANPASSUNG DIMENSION","ДИМЕНЗИЯ ЗА НАПАСВАНЕ","OPTIMALISERINGS FACTOR","ADAPTATION DIAMETRE","OPTIMIZARE DIMENSIONARE","BOYUT AYARLAMA","ПОДБОР ДИАМЕТРА","PŘIZPŮSOBENÍ DIMENZE","Sistema di dimensionamento","Méretezés","DIMENZIONIRANJE","Współczynnik doboru średnic","SELECCIÓN DE TAMAÑO"]
[7,"FLOW TEMPERATURE (Tf)","TEMPERATUR VORLAUF  (Tf)","ТЕМПЕРАТУРА ПОДАВАНЕ","AANVOER TEMPERATUUR","TEMPERATURE DEPART","TEMPERATURA TUR","GİDİŞ SICAKLIĞI [°C] Tg","ТЕМПЕРАТУРА В \"ПОДАЧЕ\" (Tп)","TEPLOTA NA PŘÍVOD. VĚTVI  (Tp )","Temp. di andata(Tf)","Előremenő hőmérséklet","TEMP. POL. (Tpolaza)","Temperatura zasilania Tz","TEMPERATURA DE SUMINISTRO (Ts)"]
[8,"RETURN TEMPERATURE (Tr)","TEMPERATUR RÜCKLAUF (Tr)","ВЪЗВРАТЕНА ТЕМПЕРАТУРА","RETOUR TEMPERATUUR","TEMPERATURE RETOUR","TEMPERATURA RETUR","DÖNÜŞ SICAKLIĞI [°C] Td","ТЕМПЕРАТУРА В \"ОБРАТКЕ\" (То)","TEPLOTA NA VRATNÉ VĚTVI (Tv)","Temp. di ritorno(Tr)","Visszatérő hőmérséklet","TEMP. POV. (T povrata)","Temperatura powrotu Tp","TEMPERATURA DE RETORNO (Tr)"]
[9,"TEMP. DIFFERENCE (Tf - Tr)","TEMP. SPREIZUNG (Tf - Tr)","ТЕРМОРАЗЛИКА (захр./връщ.)","TEMPERATUUR VERSCHIL","DELTA T (Td-Tr)","DIFERENTA TEMPERATURA","SICAKLIK FARKI  (Tg - Td)","РАЗНИЦА ТЕМПЕРАТУР (Tп - Tо)","TEPLOTNÍ SPÁD (Tp-Tv)","Differenza di Temp.(Tf-Tr)","Hőmérsékletkülönbség","Δ T (Tpolaza - Tpovrata)","Różnica temperatur (Tz-Tp)","DIFERENCIA DE TEMPERATURA (Ts - Tr)"]
[10,"TRENCH LENGTH","TRASSENLÄNGE","ДЪЛЖИНА НА ТРАСЕТО","TRACEE LENGTE","L.TRANCHEE(m)","LUNGIME SANT","TRANŞE(KANAL) UZUNLUĞU","ДЛИНА ТРАНШЕИ","DÉLKA TRASY","Lunghezza dello scavo","Nyomvonal hossza","DUŽINA TRASE","Długość wykopu","LONGITUD EN ZANJA"]
[11,"HEAT LOAD kW SOURCE","LEISTUNG kW QUELLE","ПОДАВАНА МОЩНОСТ","OVER TE BRENGEN VERMOGEN kW","PUISSANCE DEPART","PUTERE SURSA kW","ISI KAYNAĞI YÜKÜ ( KW )","ТЕПЛОВАЯ НАГРУЗКА, кВт","VÝKON ZDROJE (kW)","Calore necessario in KW","Forrásoldali teljesítmény kW","SNAGA IZVORA kW ","Obciążenie cieplne kW","FUENTE DE CARGA TERMICA Kw"]
[12,"VOLUMETRIC FLOW RATE","MEDIUMMENGE","ДЕБИТ","VOLUMESTROOM","DEBIT","DEBIT VOLUMETRIC","HACİMSEL DEBİ","ОБЪЕМНЫЙ РАСХОД","OBJEMOVÝ PRŮTOK","Portata","Térfogatáram","VOLUMETRIČKA KOLIČINA MEDIJA","Natężenie przepływu","FLUJO VOLUMETRICO"]
[13,"PIPE LENGTH","ROHRLÄNGE","ДЪЛЖИНА НА ТРЪБИТЕ","BUIS LENGTE","L.TUBES (m)","LUNGIME CONDUCTA","BORU UZUNLUĞU","ДЛИНА ТРУБ","CELKOVÁ DÉLKA POTRUBÍ","Lunghezza del tubo","Vezeték hossza","DUŽINA CIJEVI","Długość rury","LONGITUD DE TUBERIA"]
[14,"OD (DIMENSION)","DA (DIMENSION)","DA (външен диаметър на тръбата)","BUITEN DIAMETER","DIAMETRE EXT.","DE(DIMENSIUNE)","BORU DIŞ ÇAPI ÖLÇÜSÜ","Dнар. НАРУЖНЫЙ ДИАМЕТР","DA (DIMENZE)","DE(dimensione)","Dk (külső átmérő)","DA ( DIMENZIJA )","Średnica rury Dz","D.E. (DIMENSION)"]
[15,"VELOCITY","FLIESSGESCHWINDIGKEIT","СКОРОСТ НА ПОТОКА","SNELHEID","VITESSE","VITEZA","HIZ","СКОРОСТЬ ПОТОКА","RYCHLOST PROUDĚNÍ","Velocità del fluido","Áramlási sebesség","BRZINA STRUJANJA","Prędkość przepływu","VELOCIDAD"]
[16,"PRESSURE DROP FLOW","DRUCKVERLUST VORLAUF","ЗАГУБА НАЛЯГАНЕ / ПОДАВАНЕ","DRUKVERLIES AANVOER","PERTES CH. DEPART","PIERDERE PRESIUNE TUR","GİDİŞ HATTI BASINÇ KAYBI","ПОТЕРЯ ДАВЛЕНИЯ В \"ПОДАЧЕ\"","TLAK. ZTRÁTA NA PŘÍV. VĚTVI","Pressione di andata","Nyomásveszteség előre","PAD TLAKA U POLAZU","Spadek ciśnienia na zasilaniu","CAIDA DE PRESION EN SUMINISTRO"]
[17,"PRESSURE DROP RETURN","DRUCKVERLUST RÜCKLAUF","ЗАГУБА НАЛЯГАНЕ / ВРЪЩАНЕ","DRUKVERLIES RETOUR","PERTES CH. RETOUR","PIERDERE PRESIUNE RETUR","DÖNÜŞ HATI BASINÇ KAYBI","ПОТЕРЯ ДАВЛЕНИЯ В \"ОБРАТКЕ\"","TLAK. ZTRÁTA NA VRAT.VĚTVI","Pressione di ritorno","Nyomásveszteség vissza","PAD TLAKA U POVRATU","Spadek ciśnienia na powrocie","CAIDA DE PRESION EN RETORNO"]
[18,"PRESSURE DROP TOTAL","DRUCKVERLUST GESAMT","ЗАГУБА НАЛЯГАНЕ ОБЩО","DRUKVERLIES TOTAAL","PERTES CH. TOTALES","PIERDERE TOTALA PRESIUNE","TOPLAM BASINÇ KAYBI","ОБЩИЕ ПОТЕРИ ДАВЛЕНИЯ","TLAKOVÁ ZTRÁTA CELKEM","Pressione totale","Nyomásveszteség összesen","UKUPAN PAD TLAKA","Całkowity spadek ciśnienia","CAIDA DE PRESION TOTAL"]
[19,"SUPPLY LINE (SINGLE LINE)","SANITÄR (EINROHRSYSTEM)","САНИТАРИЯ / БГВ","AANVOERLEIDING","LIGNE SIMPLE","CIRCUIT ALIMENTARE (ACM)","BESLEME HATTI ( TEK HAT )","ВОДОСНАБЖЕНИЕ (ОДНОТРУБНАЯ СИСТЕМА)","TEPLÁ VODA(Jednotrubní vedení)","Linea di adduzzione(singola)","Ellátó hálózat (egyvezetékes csőrendszer)","SANITARNA VODA","Przewód zasilający ( pojedyncza rura)","LINEA DE SUMINISTRO (LINEA SENCILLA)"]
[20,"HEATING / COOLING (F / R)","HEIZUNG / KÜHLUNG (VL / RL)","ОТОПЛЕНИЕ","VERWARMING / KOELING","ALLER+RETOUR","INCALZIRE/RACIRE(TUR-RETUR)","ISITMA / SOĞUTMA","ОТОПЛЕНИЕ (ДВУХТРУБНАЯ СИСТЕМА)","TOPENÍ/CHLAZENÍ(P/V)","Riscaldamento/Condizionamento(...)","Fűtés / Hűtés","GRIJANJE/HLAĐENJE","Rura podwójna ( zasilanie - powrót )","CALEFACCION / AGUA HELADA (S / R)"]
[21,"USABLE TEMP. DIFF.","NUTZSPREIZUNG","ТЕРМОРАЗЛИКА","NUTTIG TEMPERATUURVERSCHIL","DELTA T UTILE","DIFERENTA TEMPERATURA UTILA","KULLANILIR SICAKLIK FARKI","РАЗНИЦА ТЕМПЕРАТУР В ТОЧКЕ2","POUŽITELNÝ TEPELNÝ SPÁD","Differenza di Temp. utile","Felhasználható hőmérséklet külömbség","ISKORISTIVA TEMP. RAZLIKA","Obliczeniowa różnica temperatur","DIFERENCIA DE TEMPERATURA UTIL"]
[22,"USABLE LOAD","NUTZLAST","ПОЛЕЗЕН ТОВАР","NUTTIG VERMOGEN","PUISS UTILE","PUTERE UTILA","KULLANILIR ISI YÜKÜ","ДОСТАВЛЕННОЕ ТЕПЛО В ТОЧКЕ2","POUŽITELNÉ ZATÍŽENÍ","Carico utile","Felshasználható terhelés","ISKORISTIVA SNAGA","Obliczeniowe obciążenie cieplne","CARGA UTIL"]
[23,"NET VOLUME","NETZVOLUMEN","ОБЕМ НА СИСТЕМАТА","NETTO VOLUME","VOL. RESEAU","VOLUM NET","NET HACİM","ОБЪЕМ СИСТЕМЫ","OBSAH SÍTĚ","Volume netto","Hálozat volumene","VOLUMEN CJEVOVODA","Pojemność sieci","VOLUMEN TOTAL"]
[24,"SOURCE","QUELLE","ИЗТОЧНИК","BRON","DEPART","SURSA","KAYNAK","ИСТОЧНИК (1)","ZDROJ","Sorgente","Forrás teljesítmeny kW","IZVOR","Źródło ciepła","FUENTE  "]
[25,"TEMP. DIFF.","SPREIZUNG","ТЕРМОРАЗЛИКА","TEMPERATUUR VERSCHIL","DELTA T ","DIFERENTA TEMPERATURA","SICAKLIK FARKI","РАЗНИЦА ТЕМПЕРАТУР ","TEPLOTNÍ SPÁD ","Differenza di Temp.","Hőmérsékletkülönbség","TEMPERATURNA RAZLIKA","Różnica temperatury","DIFERENCIA DE TEMPERATURA"]
[26,"NO","OHNE","няма","NEE","0 K","NU","HAYIR","НЕТ","-----","No","nem, nincs","BEZ","---------","NO"]
[27,"PUMP","PUMPE","ПОМПА","POMP","POMPE","POMPA","POMPA","НАСОС","ČERPADLO","Pompa","Szivattyú","PUMPA","Pompa","BOMBA"]
[28,"RESERVE PRESSURE FOR PUMP","VORDRUCK FÜR PUMPENAUSLEGUNG","ПРЕДПИСАНИЕ ЗА ИЗБОР НА ПОМПА","DRUKRESERVE VOOR POMP","PERTES CH. ADDITIONNELLES ","REZERVA PRESIUNE POMPA","POMPA YEDEK BASINCI","ПОТЕРИ ДАВЛЕНИЯ ВО \"ВНУТРЯНКЕ\"","TLAK PŘÍDAVNÉHO ČERPADLA","Press. di riserva per la pompa","A szivattú nyomástartaléka","TLAČNA REZERVA PUMPE","Rezerwowe ciśnienie pompy","PRESION DE RESERVA PARA BOMBA"]
[29,"Temperature °C","Temperatur °C","Температура °C","Temperatuur °C","Température °C","Temperatura °C","Sıcaklık °C","Температура °C","Teplota° C","Temp. in °C","Hőmérséklet °C","Temperatura °C","Temperatura °C","Temperatura °C"]
[30,"Pressure loss bar","Druckverlust bar","Загуба на налягане bar","Drukverlies (bar)","Pertes ch. Lin.","Pierdere presiune bar","Basınç kaybı [bar] ","Потери давления bar","Tlaková ztráta bar","Perdita di pressione in bar","Nyomásveszteség bar","Pad tlaka bar","Strata ciśnienia, bar","Pérdida de presión bar"]
[31,"Dimension OD","Dimension DA","Размер на тръбата DA","Buitendiameter","Diamètre Ext","Diametru exterior","Boyut ( DIŞ ÇAP)","ДИАМЕТР Dнар.","Dimenze (DA)","Diamentro","Dk (külső átmérő)","DA ( DIMENZIJA )","Średnica Dz","Dimensión D.E."]
[32,"END POINT","END - PUNKT","ПОЛЕЗЕН ТОВАР","EINDPUNT","DESTINATION","PUNCT FINAL","SON NOKTA","КОНЕЧНАЯ ТОЧКА (2)","KONEČNÝ BOD","Fine linea","Végpont","Završna točka","Odbiorca","PUNTO FINAL"]
[33,"FLOW","VORLAUF ","ПОДАВАНЕ","AANVOER","DEPART","TUR","GİDİŞ HATTI","\"ПОДАЧА\"","Přív. větev","Portata","Előre","POLAZ","Zasilanie","FLUJO  "]
[34,"RETURN","RÜCKLAUF ","ВРЪЩАНЕ","RETOUR","RETOUR","RETUR","DÖNÜŞ HATTI","\"ОБРАТКА\"","Vrat. větev","Ritorno","Vissza","POVRAT","Powrót","RETORNO"]
[35,"not appliable","entfällt","НЯМА","N.V.T.","Inapplicable","Neaplicabil","Uygulanamaz","не применяемо","nezadáno","Non applicabile","Nem meghatározott","nije primjenjivo","Nie odpowiedni","no aplica"]
[36,"Soil temperature","Erdtemperatur","температура земя","Bodem temperatuur","Température Sol ","Temperatura sol","Toprak (zemin) sıcaklığı","Температура почвы","Teplota zeminy","Temp. del terreno","Talajhőmérséklet","Temperatura tla","Temperatura gruntu","Temperatura del suelo"]
[37,"Coverage","Überdeckung","дълб. на полагане","gronddekking","Recouvrement","Adancime sant","Dolgu yuksekligi","Глубина заложения","Výška krytí","Copertura","Átfedés","Pokrov","Głębokość wykopu","Cubierta"]
[38,"Lambda soil","Lambda Erde","Lambda земя","Lambda bodem","Lambda Sol","Lambda Sol","Toprak (zemin) ısı iletkenlik katsayısı ","λ почвы","Lambda zeminy","Lambda del terreno","Talaj hővezetési tényező Lambda","Lambda tla","Lambda gruntu","Valor Lambda de suelo"]
[39,"Temperature drop Flow","Temperaturabfall VORLAUF","Темп.загуба ПОДАВАНЕ","Temperatuurverlies Aanvoer","Chute temp. ligne départ","Pierdere temperatura tur","Sicaklik kaybi","Потери темп. в \"подаче\"","Teplotní ztráta - přívod.","Temp. di rugiada","Hömérsékletcsökkenés előre","Pad temperature u polazu","Spadek temperatury na zasilaniu","Disminución de temperatura de flujo"]
[40,"Trench Length","Trassenlänge","Дължина на ТРАСЕТО","Tracee Lengte","Long.Tranch.m","Lungime sant","Tranşe (kanal) uzunluğu","Длина траншеи","Délka trasy","Lunghezza dello scavo","Nyomvonal hossza","Dužina trase","Długość wykopu","Longitud de zanja"]
[41,"Dwell time Flow","Verweildauer VORLAUF","Времетраене на ПОТОКА","Verblijfstijd Stroming","Durée Ecoulement","DURATA PARCURS TUR","Akış süresi","Время подачи","Prodleva - přívodní větev","Tempo di riempimento","Tartózkodási idő előre","Vrijeme protoka u polazu","Czas przepływu","Tiempo de permanencia del fluido"]
[42,"Pressure rating","Druckreihe","Налягане","Drukklasse","Press. Service","PRESIUNEA REGIM","Basınç değeri","Номинал. давление","Tlaková řada","Pressione d'esercizio","Nyomásgörbe (vezeték jelleggörbe)","Tlačni red","Ciśnienie odniesienia","Rango de presión"]
[43,"max. Pressure","Maximaldruck","Max налягане","Maximum druk","Press. Max.","Presiune Max.","max.Basınç","Max. давление ","Maximální tlak","Pressione massima","Maximális nyomás","Maksimalni tlak","Max. ciśnienie","Presión máxima"]
[44,"Pressure drop","Druckverlust","загуба налягане","Drukval","Pertes Chges.","Cadere Presiune","Basınç kaybı bar ","Потери давления","Tlaková ztráta","Perdita di carico","Nyomásveszteség","Pad tlaka","Spadek ciśnienia","Caída de presión"]
[45,"Reserve press.","Druckreserve","резерв налягане","Drukreserve  ","Réserve Press.","Rezerva presiune","rezerv basinc","Резерв давления","Tlaková rezerva","Pressione residua","Nyomástartalék","Tlačna rezerva","Rezerwa ciśnienia","Presión de reserva"]
[46,"at 95°C","bei 95°C","при 95°C","bij 95°C","à 95°C","la  95°C","95°C de","при 95°C","při 95°C","a 95°C","95°C - Mellett","pri 95° C","przy 95 °C","a 95°C"]
[47,"at Service Temperature","bei Anwendungstemperatur","при прилаганата темпер.","bij bedrijfstemperatuur","à Température de Service","la Temperatura de lucru","İşletme sıcaklığında","при рабочей температуре","při provozní teplotě","alla Temp. di esercizio","Felhasználási hőmérséklet mellett","PRI RADNOJ TEMPERATURI","Przy temperaturze roboczej","a Temperatura de Servicio"]
[48,"FLEXALEN pipes only","im FLEXALEN Rohr","в тръбите","FLEXALEN leidingen","Rés. FLEXALEN seul","Conducte Flexalen","Sadece FLEXALEN borular","Только в трубах Flexalen","Pouze pro potr.FLEXALEN","delle tubazioni Flexalen","Flexalen csőben","samo za FLEXALEN cijevi ","Tylko dla rur Flexalen","Solo tubería FLEXALEN"]
[49,"at Service Temperature","bei Anwendungstemperatur","при прилаганата темпер.","BIJ BEDR TEMP","à Température de Service","la Temperatura de lucru","İşletme sıcaklığında","при рабочей температуре","při provozní teplotě","alla Temp. di esercizio","Felhasználási hőmérséklet mellett","pri radnoj temperaturi","Przy temperaturze roboczej","a Temperatura de Servicio"]
[50,"PLEASE CHOOSE APPLICATION:","BITTE ANWENDUNG WÄHLEN:","МОЛЯ ИЗБЕРЕТЕ ПРИЛОЖЕНИЕТО:","SELECTEER TOEPASSING:","CHOIX DE L'APPLICATION","VA RUGAM ALEGETI APLICATIA","LÜTFEN UYGULAMAYI SEÇİN:","ВЫБЕРИТЕ СИСТЕМУ:","PROSÍM VYPLŇTE UŽITÍ:","Prego scegliere l'applicazione","Felhasználási terület kiválasztása","MOLIMO ODABERITE NAMJENU:","Proszę wybrać zastosowanie","FAVOR DE SELECCIONAR APLICACIÓN:"]
[51,"SUPPLY LINE →","SANITÄR →","САНИТАРИЯ / БГВ →","TOEVOERLEIDING →","LIGNE SIMPLE →","CIRCUIT A.C.M →","BESLEME HATTI ( TEK HAT ) →","ВОДОСНАБЖЕНИЕ  →","TEPLÁ VODA  →","Linea di alimentazione","Ellátó hálózat","SANITARNA VODA →","Rura pojedyncza →","LINEA DE SUMINISTRO →"]
[52,"HEATING / COOLING →","HEIZUNG / KÜHLUNG →","ОТОПЛЕНИЕ  →","VERWARMING / KOELING →","A/R CHAUF/EAU.GL →","INCALZIRE/RACIRE  →","ISITMA / SOĞUTMA →","ОТОПЛЕНИЕ  →","TOPENÍ/CHLAZENÍ →","Riscaldamento/Condizionamento(...)","Fűtés / Hűtés","GRIJANJE  /  HLAĐENJE →","Rura podwójna →","CALEFACCION / AGUA HELADA →"]
[53,"Single pipe system:",null,null,null,"Ligne Simple","SISTEM CONDUCTA SIMPLA","Tek Borulu Sistemler:","Обнотрубная система:","Jednotrubní systém:","Sistema di tubazioni singole","Egyvezetékes csőrendszer","Jednocjevni sustav:","System pojedynczych rur","Sistema de tubo sencillo:"]
[54,"TEMPERATURE","TEMPERATUR","Въведи температура в °C:","VUL DE TEMPERATUUR IN VAN HET MEDIUM","TEMPERATURE","TEMPERATURA","SICAKLIK","ТЕМПЕРАТУРА [°C]","TEPLOTA","Temp.","Hőmérséklet","TEMPERATURA","Temperatura","TEMPERATURA"]
[55,"FILL IN TRENCH LENGTH","TRASSENLÄNGE","Въведи дължина на трасето в м:","VUL DE LENGTE VAN HET TRACEE IN","LONGUEUR DE TRANCHÉE","LUNGIME SANT","TRANŞE(KANAL) UZUNLUĞUNU GİR","ВВЕДИТЕ ДЛИНУ ТРАНШЕИ в [м]","ZADEJTE DÉLKU TRASY","Lunghezza dello scavo","Vezeték hossza (Kitölti a nyomvonal hosszat)","U DUŽINI TRASE","Wypełnienie długość wykopu","LLENADO DE LONGITUD DE ZANJA"]
[56,"QUANTITY OF LIQUID","MEDIUMMENGE","Въведи дебит в л/сек:","HOEVEELHEID VLOEISTOF","DEBIT","DEBIT","AKIŞKANIN  DEBİSİ ","РАСХОД [литров/сек]","MNOŽSTVÍ MEDIA","Portata","(Folyadék mennyiség) Közegmennyiség","KOLIČINA MEDIJA","Natężenie przepływu","CANTIDAD DE LIQUIDO"]
[57,"ADDITIONAL PRESSURE FOR PUMP","VORDRUCK für PUMPE","Въведи налягане в крайна точка в bar:","ADDITIONELE DRUK VOOR DE POMP","Press. additionnelle à la pompe","PRESIUNE SUPLIMENTARA POMPA","POMPA İLAVE BASINCI","ПОТЕРИ ДАВЛЕНИЯ ВО \"ВНУТРЯНКЕ\" [bar]","PŘÍDAVNÝ TLAK ČERPADLA","Press. aggiuntiva per la pompa","A Csatlakazó rendszer nyomásesése","PRETLAK PUMPE","Dodatkowe ciśnienie pompy","PRESION ADICIONAL PARA BOMBA"]
[58,"Twin line system:",null,null,null,null,"Circuit dublu","Çift Hatlı(gidiş-dönüş) Sistemler:","Двухтрубная система:","Dvoutrubní systém:","Sistema di tubazioni doppie","Többvezetékes csőrendszer","Dvocjevni sustav:","System podwójnych rur","Sistema de tubo gemelo:"]
[59,"FLOW TEMPERATURE","TEMPERATUR VORLAUF","Въведи температура на подаване в °C:","VUL DE AANVOER TEMPERATUUR IN","TEMPERATURE DEPART","TEMPERATURA TUR","GIDIS SICAKLIGI","ТЕМПЕРАТУРА В ПОДАЮЩЕМ ТРУБОПРОВОДЕ","TEPLOTA NA PŘÍVOD. VĚTVI  ","Temp. del fluido","Hőmérséklet előre","TEMPERATURA POLAZA","Temperatura zasilania ","TEMPERATURA DE SUMINISTRO  "]
[60,"RETURN TEMPERATURE","TEMPERATUR RÜCKLAUF ","Въведи възвратна температура в °C:","VUL DE RETOUR TEMPERATUUR IN","TEMPERATURE RETOUR","TEMPERATURA RETUR","DONUS SICAKLIGI","ТЕМПЕРАТУРА В ОБРАТНОМ ТРУБОПРОВОДЕ","TEPLOTA NA VRATNÉ VĚTVI ","Temp. del fluido di ritorno","Hőmérséklet vissza","TEMPERATURA POVRATA","Temperatura powrotu ","TEMPERATURA DE RETORNO"]
[61,"TRENCH LENGTH","TRASSENLÄNGE","Въведи дължина на трасето в м:","VUL DE LENGTE VAN HET TRACEE IN","LONG.TRANCH.","LUNGIME SANT","TRANŞE(KANAL) UZUNLUĞU","ДЛИНА ТРАНШЕИ [м]","DÉLKA TRASY","Lunghezza dello scavo","Nyomvonal hossz","DUŽINA TRASE","Długość wykopu","LONGITUD EN ZANJA"]
[62,"HEAT LOAD","ÜBERTRAGENE LEISTUNG ab HEIZHAUS","Въведи мощност в крайна точка в kW:","VUL HET TE TRANSPORTEREN VERMOGEN IN","PUISSANCE","SARCINA TERMICA","ISI YÜKÜ","ТЕПЛОВАЯ НАГРУЗКА [кВт]","PŘENESENÝ VÝKON","Perdita di calore","Energia mennyiség kazánházból","SNAGA PREUZETA OD KOTLOVNICE","Obciążenie cieplne ","FUENTE DE CALOR"]
[63,"ADDITIONAL PRESSURE FOR PUMP","VORDRUCK für PUMPE ","Въведи налягане в крайна точка в bar:","ADDITIONELE DRUK VOOR DE POMP","PRESS. ADDITIONNELLE A LA POMPE","PRESIUNE SUPLIMENTARA POMPA","POMPA İLAVE BASINCI","ПОТЕРИ ДАВЛЕНИЯ ВО \"ВНУТРЯНКЕ\" [bar]","PŘÍDAVNÝ TLAK ČERPADLA","Press. aggiuntiva per la pompa","Szivattyú előnyomása","PRETLAK PUMPE","Dodatkowe ciśnienie pompy","PRESION ADICIONAL PARA BOMBA"]
[64]
[65,"°C","°C","°C","°C","°C","°C","°C","°C","°C","°C","°C","°C","°C","°C"]
[66,"m","m","m","m","m","m","m","м","m","m","m","m","m","m"]
[67,"l/s","l/s","l/s","l/s","l/s","l/s","lt/s","l/s","l/s","l/s","l/s","l/s","l/s","l/s"]
[68,"bar","bar","bar","bar","bar","bar","bar","bar","bar","bar","bar","bar","bar","bar"]
[69]
[70,"°C","°C","°C","°C","°C","°C","°C","°C","°C","°C","°C","°C","°C","°C"]
[71,"°C","°C","°C","°C","°C","°C","°C","°C","°C","°C","°C","°C","°C","°C"]
[72,"m ","m ","m ","m ","m ","m ","m","м","m ","m","m","m ","m ","m "]
[73,"kW","kW","kW","kW","kW","Kw","KW","кВт","kW","kW","kW","kW","kW","kW"]
[74,"bar","bar","bar","bar","bar","bar","bar","bar","bar","bar","bar","bar","bar","bar"]
[75,"SELECT A FLEXALEN PRODUCT","FLEXALEN PRODUKT WÄHLEN",null,"KIES EEN FLEXALEN PRODUKT","Choisir un produit FLEXALEN",null,null,"ВЫБЕРИТЕ ТИП ТРУБЫ FLEXALEN","Výběr potrubí Flexalen",null,null,null,"Wybierz produkt Flexalen","SELECCIONAR UN PRODUCTO FLEXALEN"]
[76,"ENERGY LOSS PER m' TRENCH LENGTH","WÄRMEVERLUST PRO TRASSENMETER",null,"WARMTEVERLIES PER METER SLEUF","Pertes de chaleur par mètre de tranchée",null,null,"ТЕПЛОВЫЕ ПОТЕРИ С 1 МЕТРА ТРАССЫ","Tepelné ztráty /bm",null,null,null,"Strata ciepła na metr długości rury w wykopie","PERDIDA TERMICA POR METRO DE LONGITUD EN ZANJA"]
[77,"Choose product","Produkt wählen",null,"Kies produkt",null,null,null,"Выберите тип трубы",null,null,null,null,"Wybierz produkt ","Seleccionar producto"]
[78,"ENERGY LOSS TOTAL","WÄRMEABSTRAHLUNG NETZ",null,"TOTAAL WARMTEVERLIES","Pertes de chaleur totales",null,null,"ТЕПЛОВЫЕ ПОТЕРИ","Celkové tepelné ztráty na trase",null,null,null,"Całkowita strata ciepła","PERDIDA TERMICA TOTAL"]
[79,"FLEXALEN Product","FLEXALEN Produkt",null,"FLEXALEN Produkt","FLEXALEN",null,null,"FLEXALEN продукт",null,null,null,null,"Flexalen produktu","Producto FLEXALEN"]
[80,"Quantity","Menge",null,"Aantal",null,null,null,"количество",null,null,null,null,"Ilość","Cantidad  "]
[81]
[82]
[83]
[84]
[85]
[86]
[87]
[88]
[89]
[90]
[91]
[92]
[93]
[94]
[95]
[96]
[97]
[98]
[99]
[100]

{"sheet":"Release Info","index":8,"n_rows":22,"n_cols":3,"rows_kept":22,"cut":false,"hidden":true,"merged":[]}
[null,"Flexalen QuickCalc "]
[null,"Flexalen 600"]
[]
["Version","Date","Changes"]
["v8.00 (beta)","2010-02-03","1st multilingual language: english, german, bulgarian, dutch, Heatloss - temperature drop updated / new outlook,..."]
["v8.00 (beta)","2010-02-09","checked by several people and corrected"]
["v8.00","2010-03-23","Sprachen OK: en, ger, ru, bul, dutch, turkish, romanian"]
["v8.01","2010-06-04","Sprachen - Übersetzungsfehler behoben; v [m/s] Tabelle angefügt; Druckstufe neu für 16-110 und 125-225; Instruction en - aktualisiert"]
["v8.10","2010-07-26","TF faktor angepasst von 1,03 auf 1,02 (nicht 1,011 wie beim großen, robusterer Wert)"]
[null,null,"Alle Beschreibungen geändert auf Flexalen anstatt Flexalen 600"]
[null,null,"alle Parameter aktualisiert"]
[null,null,"CZ language added"]
["v8.11","2010-10-14","Italian & hungarian language added"]
[null,"2010-10-20","corrections translation hungarian"]
[null,"2010-10-27","correction translation italien"]
["v8.12","2011-03-07","croatian language added"]
["v9.00","2011-06-20","Temperature drop calc completely new, Heat losses new, new spread sheet \"Parameter_HL\""]
["v9.01","2011-07-05","update languages, new polish language, some bug fixes"]
["v9.02","2011-07-20","correct polish language, bug fix 75mm product choosing"]
["v9.10","2011-12-05","spanish language, VBA code cleaned up"]
["v9.12","2014-08-12","added VS-RH160A63 flow+return"]
["v9.13","2016-02-15","Heat loss updated, temperature drop updated with difference between supply and return energy loss and full assorment included"]